BDBM50045077 CHEMBL3310094
SMILES: CN(C)C(=O)Cn1c2cc(Cc3ccc(F)cc3)cnc2c(O)c(C(=O)NCCN2CCOCC2)c1=O
InChI Key: InChIKey=VOJYATSRMMPZPE-UHFFFAOYSA-N
Data: 1 IC50
Activity Spreadsheet -- Enzyme Inhibition Constant Data from BindingDB
Found 1 hit for monomerid = 50045077
Trg + Lig
Ki
nM
ΔG°
kcal/mole
IC50
nM
Kd
nM
EC50/IC50
nM
koff
s-1
kon
M-1s-1
pHTemp
°C
Integrase
(Human immunodeficiency virus 1)
BDBM50045077
(CHEMBL3310094)
Show SMILES CN(C)C(=O)Cn1c2cc(Cc3ccc(F)cc3)cnc2c(O)c(C(=O)NCCN2CCOCC2)c1=O
Show InChI InChI=1S/C26H30FN5O5/c1-30(2)21(33)16-32-20-14-18(13-17-3-5-19(27)6-4-17)15-29-23(20)24(34)22(26(32)36)25(35)28-7-8-31-9-11-37-12-10-31/h3-6,14-15,34H,7-13,16H2,1-2H3,(H,28,35)
n/an/a 8.60n/an/an/an/an/an/a
GlaxoSmithKline Research& Development
Curated by ChEMBL
Assay Description
Inhibition of recombinant HIV-1 integrase by strand-transfer assay
Bioorg Med Chem Lett 24: 3104-7 (2014)
Article DOI: 10.1016/j.bmcl.2014.05.011
BindingDB Entry DOI: 10.7270/Q2BC415P