BDBM50045081 CHEMBL3310083
SMILES: CNC(=O)c1c(O)c2ncc(Cc3ccc(F)cc3)cc2n(CC(=O)NCCN(C)C)c1=O
InChI Key: InChIKey=DJURIDGJRPQBQW-UHFFFAOYSA-N
Data: 1 IC50
Activity Spreadsheet -- Enzyme Inhibition Constant Data from BindingDB
Found 1 hit for monomerid = 50045081
Trg + Lig
Ki
nM
ΔG°
kcal/mole
IC50
nM
Kd
nM
EC50/IC50
nM
koff
s-1
kon
M-1s-1
pHTemp
°C
Integrase
(Human immunodeficiency virus 1)
BDBM50045081
(CHEMBL3310083)
Show SMILES CNC(=O)c1c(O)c2ncc(Cc3ccc(F)cc3)cc2n(CC(=O)NCCN(C)C)c1=O
Show InChI InChI=1S/C23H26FN5O4/c1-25-22(32)19-21(31)20-17(29(23(19)33)13-18(30)26-8-9-28(2)3)11-15(12-27-20)10-14-4-6-16(24)7-5-14/h4-7,11-12,31H,8-10,13H2,1-3H3,(H,25,32)(H,26,30)
n/an/a 22n/an/an/an/an/an/a
GlaxoSmithKline Research& Development
Curated by ChEMBL
Assay Description
Inhibition of recombinant HIV-1 integrase by strand-transfer assay
Bioorg Med Chem Lett 24: 3104-7 (2014)
Article DOI: 10.1016/j.bmcl.2014.05.011
BindingDB Entry DOI: 10.7270/Q2BC415P