BDBM50045106 CHEMBL3309903
SMILES: CNC(=O)c1c(O)c2ncc(Cc3ccc(F)cc3)cc2n(CC(N)=O)c1=O
InChI Key: InChIKey=MIRXBDXWMZSIRY-UHFFFAOYSA-N
Data: 1 IC50
Activity Spreadsheet -- Enzyme Inhibition Constant Data from BindingDB
Found 1 hit for monomerid = 50045106
Trg + Lig
Ki
nM
ΔG°
kcal/mole
IC50
nM
Kd
nM
EC50/IC50
nM
koff
s-1
kon
M-1s-1
pHTemp
°C
Integrase
(Human immunodeficiency virus 1)
BDBM50045106
(CHEMBL3309903)
Show SMILES CNC(=O)c1c(O)c2ncc(Cc3ccc(F)cc3)cc2n(CC(N)=O)c1=O
Show InChI InChI=1S/C19H17FN4O4/c1-22-18(27)15-17(26)16-13(24(19(15)28)9-14(21)25)7-11(8-23-16)6-10-2-4-12(20)5-3-10/h2-5,7-8,26H,6,9H2,1H3,(H2,21,25)(H,22,27)
n/an/a 7.60n/an/an/an/an/an/a
GlaxoSmithKline Research& Development
Curated by ChEMBL
Assay Description
Inhibition of recombinant HIV-1 integrase by strand-transfer assay
Bioorg Med Chem Lett 24: 3104-7 (2014)
Article DOI: 10.1016/j.bmcl.2014.05.011
BindingDB Entry DOI: 10.7270/Q2BC415P