BDBM50045181 1-{4-[2-(3,4-Dichloro-phenyl)-acetyl]-3-pyrrolidin-1-ylmethyl-piperazin-1-yl}-propan-1-one::CHEMBL62663
SMILES: CCC(=O)N1CCN(C(CN2CCCC2)C1)C(=O)Cc1ccc(Cl)c(Cl)c1
InChI Key: InChIKey=UKHGQEBRWHHGHL-UHFFFAOYSA-N
Data: 1 IC50
Activity Spreadsheet -- Enzyme Inhibition Constant Data from BindingDB
Found 1 hit for monomerid = 50045181
Trg + Lig
Ki
nM
ΔG°
kcal/mole
IC50
nM
Kd
nM
EC50/IC50
nM
koff
s-1
kon
M-1s-1
pHTemp
°C
Kappa-type opioid receptor
(Homo sapiens (Human))
BDBM50045181
(1-{4-[2-(3,4-Dichloro-phenyl)-acetyl]-3-pyrrolidin...)
Show SMILES CCC(=O)N1CCN(C(CN2CCCC2)C1)C(=O)Cc1ccc(Cl)c(Cl)c1
Show InChI InChI=1S/C20H27Cl2N3O2/c1-2-19(26)24-9-10-25(16(14-24)13-23-7-3-4-8-23)20(27)12-15-5-6-17(21)18(22)11-15/h5-6,11,16H,2-4,7-10,12-14H2,1H3
Reactome pathway
n/an/a 6.90n/an/an/an/an/an/a
Glaxo Group Research Ltd.
Curated by ChEMBL
Assay Description
In vitro agonist activity at kappa opioid receptor in rabbit vas deferens.
J Med Chem 36: 2075-83 (1993)
BindingDB Entry DOI: 10.7270/Q2D50NKJ