BDBM50045374 CHEMBL3315290
SMILES: OC1(CCNCC1)c1ccc(cc1)-n1ccnc1-c1ccc(o1)-c1ccc(Cl)cc1
InChI Key: InChIKey=VUGGMXYOWPIBND-UHFFFAOYSA-N
Data: 1 IC50
Activity Spreadsheet -- Enzyme Inhibition Constant Data from BindingDB
Found 1 hit for monomerid = 50045374
Trg + Lig
Ki
nM
ΔG°
kcal/mole
IC50
nM
Kd
nM
EC50/IC50
nM
koff
s-1
kon
M-1s-1
pHTemp
°C
MAP kinase-activated protein kinase 2
(Homo sapiens (Human))
BDBM50045374
(CHEMBL3315290)
Show SMILES OC1(CCNCC1)c1ccc(cc1)-n1ccnc1-c1ccc(o1)-c1ccc(Cl)cc1
Show InChI InChI=1S/C24H22ClN3O2/c25-19-5-1-17(2-6-19)21-9-10-22(30-21)23-27-15-16-28(23)20-7-3-18(4-8-20)24(29)11-13-26-14-12-24/h1-10,15-16,26,29H,11-14H2
NCI pathway
Reactome pathway
n/an/a 26n/an/an/an/an/an/a
Merck Research Laboratories
Curated by ChEMBL
Assay Description
Inhibition of MK2 (unknown origin) incubated for 30 mins by MK2 IMAP assay
Bioorg Med Chem Lett 24: 3609-13 (2014)
Article DOI: 10.1016/j.bmcl.2014.05.024
BindingDB Entry DOI: 10.7270/Q2F47QR7