BDBM50045406 CHEMBL3314158
SMILES: Clc1ccc(cc1)-c1ccc(o1)-c1nccn1-c1ccc(cc1)-c1ccncc1
InChI Key: InChIKey=AJMLIFIYLIPWOM-UHFFFAOYSA-N
Data: 1 IC50
Activity Spreadsheet -- Enzyme Inhibition Constant Data from BindingDB
Found 1 hit for monomerid = 50045406
Trg + Lig
Ki
nM
ΔG°
kcal/mole
IC50
nM
Kd
nM
EC50/IC50
nM
koff
s-1
kon
M-1s-1
pHTemp
°C
MAP kinase-activated protein kinase 2
(Homo sapiens (Human))
BDBM50045406
(CHEMBL3314158)
Show SMILES Clc1ccc(cc1)-c1ccc(o1)-c1nccn1-c1ccc(cc1)-c1ccncc1
Show InChI InChI=1S/C24H16ClN3O/c25-20-5-1-19(2-6-20)22-9-10-23(29-22)24-27-15-16-28(24)21-7-3-17(4-8-21)18-11-13-26-14-12-18/h1-16H
NCI pathway
Reactome pathway
n/an/a 3.73E+3n/an/an/an/an/an/a
Merck Research Laboratories
Curated by ChEMBL
Assay Description
Inhibition of MK2 (unknown origin) incubated for 30 mins by MK2 IMAP assay
Bioorg Med Chem Lett 24: 3609-13 (2014)
Article DOI: 10.1016/j.bmcl.2014.05.024
BindingDB Entry DOI: 10.7270/Q2F47QR7