BDBM50045425 CHEMBL3314141
SMILES: N#Cc1ccc(cc1)-c1ccc(o1)-c1nccn1-c1ccc(cc1)N1CCNCC1
InChI Key: InChIKey=GCFIVUQAQNZDRN-UHFFFAOYSA-N
Data: 1 IC50
Activity Spreadsheet -- Enzyme Inhibition Constant Data from BindingDB
Found 1 hit for monomerid = 50045425
Trg + Lig
Ki
nM
ΔG°
kcal/mole
IC50
nM
Kd
nM
EC50/IC50
nM
koff
s-1
kon
M-1s-1
pHTemp
°C
MAP kinase-activated protein kinase 2
(Homo sapiens (Human))
BDBM50045425
(CHEMBL3314141)
Show SMILES N#Cc1ccc(cc1)-c1ccc(o1)-c1nccn1-c1ccc(cc1)N1CCNCC1
Show InChI InChI=1S/C24H21N5O/c25-17-18-1-3-19(4-2-18)22-9-10-23(30-22)24-27-13-16-29(24)21-7-5-20(6-8-21)28-14-11-26-12-15-28/h1-10,13,16,26H,11-12,14-15H2
NCI pathway
Reactome pathway
n/an/a 85n/an/an/an/an/an/a
Merck Research Laboratories
Curated by ChEMBL
Assay Description
Inhibition of MK2 (unknown origin) incubated for 30 mins by MK2 IMAP assay
Bioorg Med Chem Lett 24: 3609-13 (2014)
Article DOI: 10.1016/j.bmcl.2014.05.024
BindingDB Entry DOI: 10.7270/Q2F47QR7