BDBM50045508 CHEMBL3314225
SMILES: CCCC(=O)N[C@H](Cc1ccc(O)cc1)C(=O)N[C@H](Cc1c[nH]c2ccccc12)C(=O)N[C@@H](CC(N)=O)C(=O)N[C@@H]([C@@H](C)O)C(=O)N[C@@H](Cc1ccccc1)C(=O)NNC(=O)N[C@@H](CC(C)C)C(=O)N[C@@H](CCCNC(=N)NC)C(=O)N[C@@H](Cc1c[nH]c2ccccc12)C(N)=O
InChI Key:
Data: 1 KI  2 EC50
Activity Spreadsheet -- Enzyme Inhibition Constant Data from BindingDB
Found 3 hits for monomerid = 50045508
Trg + Lig
Ki
nM
ΔG°
kcal/mole
IC50
nM
Kd
nM
EC50/IC50
nM
koff
s-1
kon
M-1s-1
pHTemp
°C
KiSS-1 receptor
(Rattus norvegicus)
BDBM50045508
(CHEMBL3314225)
Show SMILES CCCC(=O)N[C@H](Cc1ccc(O)cc1)C(=O)N[C@H](Cc1c[nH]c2ccccc12)C(=O)N[C@@H](CC(N)=O)C(=O)N[C@@H]([C@@H](C)O)C(=O)N[C@@H](Cc1ccccc1)C(=O)NNC(=O)N[C@@H](CC(C)C)C(=O)N[C@@H](CCCNC(=N)NC)C(=O)N[C@@H](Cc1c[nH]c2ccccc12)C(N)=O |r|
Reactome pathway
0.110n/an/an/an/an/an/an/an/a
Takeda Pharmaceutical Company Ltd.
Curated by ChEMBL
Assay Description
Displacement of radioligand from rat KISS1R transfected in CHO cells
J Med Chem 57: 6105-15 (2014)
Article DOI: 10.1021/jm5005489
BindingDB Entry DOI: 10.7270/Q2SF2XSG
G-protein Coupled Receptor 54
(Homo sapiens (Human))
BDBM50045508
(CHEMBL3314225)
Show SMILES CCCC(=O)N[C@H](Cc1ccc(O)cc1)C(=O)N[C@H](Cc1c[nH]c2ccccc12)C(=O)N[C@@H](CC(N)=O)C(=O)N[C@@H]([C@@H](C)O)C(=O)N[C@@H](Cc1ccccc1)C(=O)NNC(=O)N[C@@H](CC(C)C)C(=O)N[C@@H](CCCNC(=N)NC)C(=O)N[C@@H](Cc1c[nH]c2ccccc12)C(N)=O |r|
Reactome pathway
n/an/an/an/a 0.800n/an/an/an/a
Takeda Pharmaceutical Company Ltd.
Curated by ChEMBL
Assay Description
Agonist activity at human KISS1R transfected in CHO cells assessed as intracellular calcium flux after 24 hrs by functional FLIPR assay
J Med Chem 57: 6105-15 (2014)
Article DOI: 10.1021/jm5005489
BindingDB Entry DOI: 10.7270/Q2SF2XSG
KiSS-1 receptor
(Rattus norvegicus)
BDBM50045508
(CHEMBL3314225)
Show SMILES CCCC(=O)N[C@H](Cc1ccc(O)cc1)C(=O)N[C@H](Cc1c[nH]c2ccccc12)C(=O)N[C@@H](CC(N)=O)C(=O)N[C@@H]([C@@H](C)O)C(=O)N[C@@H](Cc1ccccc1)C(=O)NNC(=O)N[C@@H](CC(C)C)C(=O)N[C@@H](CCCNC(=N)NC)C(=O)N[C@@H](Cc1c[nH]c2ccccc12)C(N)=O |r|
Reactome pathway
n/an/an/an/a 3.70n/an/an/an/a
Takeda Pharmaceutical Company Ltd.
Curated by ChEMBL
Assay Description
Agonist activity at rat KISS1R transfected in CHO cells assessed as intracellular calcium flux after 24 hrs by functional FLIPR assay
J Med Chem 57: 6105-15 (2014)
Article DOI: 10.1021/jm5005489
BindingDB Entry DOI: 10.7270/Q2SF2XSG