null
SMILES: CNC(=N)NCCC[C@H](NC(=O)[C@H](CC(C)C)NC(=O)NNC(=O)[C@H](Cc1ccccc1)NC(=O)[C@@H](NC(=O)[C@H](CC(N)=O)NC(=O)[C@@H](Cc1ccncc1)NC(=O)[C@H](N)Cc1ccc(O)cc1)c1ccccc1)C(=O)N[C@@H](Cc1c[nH]c2ccccc12)C(N)=O
InChI Key:
Activity Spreadsheet -- Enzyme Inhibition Constant Data from BindingDB
Found 2 hits for monomerid = 50045519
Trg + Lig
Ki
nM
ΔG°
kcal/mole
IC50
nM
Kd
nM
EC50/IC50
nM
koff
s-1
kon
M-1s-1
pHTemp
°C
KiSS-1 receptor
(Rattus norvegicus)
BDBM50045519
(CHEMBL3314210)
Show SMILES CNC(=N)NCCC[C@H](NC(=O)[C@H](CC(C)C)NC(=O)NNC(=O)[C@H](Cc1ccccc1)NC(=O)[C@@H](NC(=O)[C@H](CC(N)=O)NC(=O)[C@@H](Cc1ccncc1)NC(=O)[C@H](N)Cc1ccc(O)cc1)c1ccccc1)C(=O)N[C@@H](Cc1c[nH]c2ccccc12)C(N)=O |r|
Reactome pathway
n/an/an/an/a 110n/an/an/an/a
Takeda Pharmaceutical Company Ltd.
Curated by ChEMBL
Assay Description
Agonist activity at rat KISS1R transfected in CHO cells assessed as intracellular calcium flux after 24 hrs by functional FLIPR assay
J Med Chem 57: 6105-15 (2014)
Article DOI: 10.1021/jm5005489
BindingDB Entry DOI: 10.7270/Q2SF2XSG
KiSS-1 receptor
(Homo sapiens (Human))
BDBM50045519
(CHEMBL3314210)
Show SMILES CNC(=N)NCCC[C@H](NC(=O)[C@H](CC(C)C)NC(=O)NNC(=O)[C@H](Cc1ccccc1)NC(=O)[C@@H](NC(=O)[C@H](CC(N)=O)NC(=O)[C@@H](Cc1ccncc1)NC(=O)[C@H](N)Cc1ccc(O)cc1)c1ccccc1)C(=O)N[C@@H](Cc1c[nH]c2ccccc12)C(N)=O |r|
Reactome pathway
n/an/an/an/a 4.40n/an/an/an/a
Takeda Pharmaceutical Company Ltd.
Curated by ChEMBL
Assay Description
Agonist activity at human KISS1R transfected in CHO cells assessed as intracellular calcium flux after 24 hrs by functional FLIPR assay
J Med Chem 57: 6105-15 (2014)
Article DOI: 10.1021/jm5005489
BindingDB Entry DOI: 10.7270/Q2SF2XSG