BDBM50045631 CHEMBL3314310::US9540323, 232::US9540323, example 232
SMILES: CC1(C)CN(c2c1c(cc(F)c2O)-c1ccc(F)cc1)c1ccccc1NC(=O)Nc1ccc(OC(F)(F)F)cc1
InChI Key: InChIKey=BENMEJNWNXDMOH-UHFFFAOYSA-N
Data: 1 KI  2 IC50
Activity Spreadsheet -- Enzyme Inhibition Constant Data from BindingDB
Found 3 hits for monomerid = 50045631
Trg + Lig
Ki
nM
ΔG°
kcal/mole
IC50
nM
Kd
nM
EC50/IC50
nM
koff
s-1
kon
M-1s-1
pHTemp
°C
Purinergic receptor P2Y1
(Homo sapiens (Human))
BDBM50045631
(CHEMBL3314310 | US9540323, 232 | US9540323, exampl...)
Show SMILES CC1(C)CN(c2c1c(cc(F)c2O)-c1ccc(F)cc1)c1ccccc1NC(=O)Nc1ccc(OC(F)(F)F)cc1
Show InChI InChI=1S/C30H24F5N3O3/c1-29(2)16-38(26-25(29)21(15-22(32)27(26)39)17-7-9-18(31)10-8-17)24-6-4-3-5-23(24)37-28(40)36-19-11-13-20(14-12-19)41-30(33,34)35/h3-15,39H,16H2,1-2H3,(H2,36,37,40)
US Patent
15 -10.7n/an/an/an/an/a7.425
Bristol-Myers Squibb Company
US Patent
Assay Description
A SPA membrane binding assay was used to identify inhibitors of [33P] 2MeS-ADP binding to cloned human P2Y1 receptors (The P2Y1 receptor membranes we...
US Patent US9540323 (2017)
BindingDB Entry DOI: 10.7270/Q289141P
Purinergic receptor P2Y1
(Homo sapiens (Human))
BDBM50045631
(CHEMBL3314310 | US9540323, 232 | US9540323, exampl...)
Show SMILES CC1(C)CN(c2c1c(cc(F)c2O)-c1ccc(F)cc1)c1ccccc1NC(=O)Nc1ccc(OC(F)(F)F)cc1
Show InChI InChI=1S/C30H24F5N3O3/c1-29(2)16-38(26-25(29)21(15-22(32)27(26)39)17-7-9-18(31)10-8-17)24-6-4-3-5-23(24)37-28(40)36-19-11-13-20(14-12-19)41-30(33,34)35/h3-15,39H,16H2,1-2H3,(H2,36,37,40)
n/an/a 390n/an/an/an/an/an/a
Bristol-Myers Squibb Research
Curated by ChEMBL
Assay Description
Antagonist activity at P2Y1 receptor in platelet-enriched human plasma assessed as 10 uM ADP-induced platelet aggregation preincubated for 1 min foll...
J Med Chem 57: 6150-64 (2014)
Article DOI: 10.1021/jm5006226
BindingDB Entry DOI: 10.7270/Q20Z74XP
Purinergic receptor P2Y1
(Homo sapiens (Human))
BDBM50045631
(CHEMBL3314310 | US9540323, 232 | US9540323, exampl...)
Show SMILES CC1(C)CN(c2c1c(cc(F)c2O)-c1ccc(F)cc1)c1ccccc1NC(=O)Nc1ccc(OC(F)(F)F)cc1
Show InChI InChI=1S/C30H24F5N3O3/c1-29(2)16-38(26-25(29)21(15-22(32)27(26)39)17-7-9-18(31)10-8-17)24-6-4-3-5-23(24)37-28(40)36-19-11-13-20(14-12-19)41-30(33,34)35/h3-15,39H,16H2,1-2H3,(H2,36,37,40)
n/an/a 0.450n/an/an/an/an/an/a
Bristol-Myers Squibb Research
Curated by ChEMBL
Assay Description
Antagonist activity at P2Y1 receptor in washed human platelets assessed as 1 uM 2-methylthio-ADP-induced calcium flux by FLIPR assay
J Med Chem 57: 6150-64 (2014)
Article DOI: 10.1021/jm5006226
BindingDB Entry DOI: 10.7270/Q20Z74XP