BDBM50045679 1-(4-Chloro-benzyl)-2-[2,2-dimethyl-3-(1H-tetrazol-5-yl)-propyl]-4-methyl-6-(5-phenyl-pyridin-2-ylmethylsulfanyl)-4,5-dihydro-1H-3-thia-1-aza-acenaphthylene::CHEMBL94307
SMILES: CC1Cc2c(SCc3ccc(cn3)-c3ccccc3)ccc3n(Cc4ccc(Cl)cc4)c(CC(C)(C)Cc4nnn[nH]4)c(S1)c23
InChI Key: InChIKey=BFCKURJEBJHCHO-UHFFFAOYSA-N
Data: 2 IC50
Activity Spreadsheet -- Enzyme Inhibition Constant Data from BindingDB
Found 2 hits for monomerid = 50045679
Trg + Lig
Ki
nM
ΔG°
kcal/mole
IC50
nM
Kd
nM
EC50/IC50
nM
koff
s-1
kon
M-1s-1
pHTemp
°C
Arachidonate 5-lipoxygenase
(Homo sapiens (Human))
BDBM50045679
(1-(4-Chloro-benzyl)-2-[2,2-dimethyl-3-(1H-tetrazol...)
Show SMILES CC1Cc2c(SCc3ccc(cn3)-c3ccccc3)ccc3n(Cc4ccc(Cl)cc4)c(CC(C)(C)Cc4nnn[nH]4)c(S1)c23
Show InChI InChI=1S/C36H35ClN6S2/c1-23-17-29-32(44-22-28-14-11-26(20-38-28)25-7-5-4-6-8-25)16-15-30-34(29)35(45-23)31(18-36(2,3)19-33-39-41-42-40-33)43(30)21-24-9-12-27(37)13-10-24/h4-16,20,23H,17-19,21-22H2,1-3H3,(H,39,40,41,42)
Reactome pathway
n/an/a 11n/an/an/an/an/an/a
Merck Frosst Centre for Therapeutic Research
Curated by ChEMBL
Assay Description
In vitro inhibition of LTB4 biosynthesis in [Ca2+]-ionophore-activated human polymorphonuclear leukocytes
J Med Chem 36: 2771-87 (1993)
BindingDB Entry DOI: 10.7270/Q28914XB
Arachidonate 5-lipoxygenase
(Rattus norvegicus)
BDBM50045679
(1-(4-Chloro-benzyl)-2-[2,2-dimethyl-3-(1H-tetrazol...)
Show SMILES CC1Cc2c(SCc3ccc(cn3)-c3ccccc3)ccc3n(Cc4ccc(Cl)cc4)c(CC(C)(C)Cc4nnn[nH]4)c(S1)c23
Show InChI InChI=1S/C36H35ClN6S2/c1-23-17-29-32(44-22-28-14-11-26(20-38-28)25-7-5-4-6-8-25)16-15-30-34(29)35(45-23)31(18-36(2,3)19-33-39-41-42-40-33)43(30)21-24-9-12-27(37)13-10-24/h4-16,20,23H,17-19,21-22H2,1-3H3,(H,39,40,41,42)
n/an/a 120n/an/an/an/an/an/a
Merck Frosst Centre for Therapeutic Research
Curated by ChEMBL
Assay Description
In vitro test for inhibition of 5-lipoxygenase in cell-free preparations from rat PMN leukocytes
J Med Chem 36: 2771-87 (1993)
BindingDB Entry DOI: 10.7270/Q28914XB