BDBM50045834 CHEMBL3314361
SMILES: CC(N(C)C)c1ccc2CN(CCc2c1)C(=O)c1cc2cc(Cl)ncc2n1C
InChI Key: InChIKey=AMQLOAKAHIONBV-UHFFFAOYSA-N
Data: 1 IC50
Activity Spreadsheet -- Enzyme Inhibition Constant Data from BindingDB
Found 1 hit for monomerid = 50045834
Trg + Lig
Ki
nM
ΔG°
kcal/mole
IC50
nM
Kd
nM
EC50/IC50
nM
koff
s-1
kon
M-1s-1
pHTemp
°C
Pyroglutamylated RF-amide peptide receptor
(Homo sapiens (Human))
BDBM50045834
(CHEMBL3314361)
Show SMILES CC(N(C)C)c1ccc2CN(CCc2c1)C(=O)c1cc2cc(Cl)ncc2n1C
Show InChI InChI=1S/C22H25ClN4O/c1-14(25(2)3)15-5-6-17-13-27(8-7-16(17)9-15)22(28)19-10-18-11-21(23)24-12-20(18)26(19)4/h5-6,9-12,14H,7-8,13H2,1-4H3
n/an/a 460n/an/an/an/an/an/a
AstraZeneca
Curated by ChEMBL
Assay Description
Inhibition of human GPR103 receptor expressed in CHOK1 cells by IP-1 assay
J Med Chem 57: 5935-48 (2014)
Article DOI: 10.1021/jm401951t
BindingDB Entry DOI: 10.7270/Q2MP54W9