BDBM50045843 8-M-PDOT::CHEMBL99377::N-(8-Methoxy-1,2,3,4-tetrahydro-naphthalen-2-yl)-propionamide
SMILES: CCC(=O)NC1CCc2cccc(OC)c2C1
InChI Key: InChIKey=RVIGBTUDFAGRTQ-UHFFFAOYSA-N
Data: 4 KI  1 IC50
Activity Spreadsheet -- Enzyme Inhibition Constant Data from BindingDB
Found 5 hits for monomerid = 50045843
Trg + Lig
Ki
nM
ΔG°
kcal/mole
IC50
nM
Kd
nM
EC50/IC50
nM
koff
s-1
kon
M-1s-1
pHTemp
°C
Melatonin
(RABBIT)
BDBM50045843
(8-M-PDOT | CHEMBL99377 | N-(8-Methoxy-1,2,3,4-tetr...)
Show SMILES CCC(=O)NC1CCc2cccc(OC)c2C1
Show InChI InChI=1S/C14H19NO2/c1-3-14(16)15-11-8-7-10-5-4-6-13(17-2)12(10)9-11/h4-6,11H,3,7-9H2,1-2H3,(H,15,16)
0.350n/an/an/an/an/an/an/an/a
Northwestern University
Curated by PDSP Ki Database
Naunyn Schmiedebergs Arch Pharmacol 355: 365-75 (1997)
Article DOI: 10.1007/pl00004956
BindingDB Entry DOI: 10.7270/Q2416VKF
Melatonin receptor
(Homo sapiens (Human))
BDBM50045843
(8-M-PDOT | CHEMBL99377 | N-(8-Methoxy-1,2,3,4-tetr...)
Show SMILES CCC(=O)NC1CCc2cccc(OC)c2C1
Show InChI InChI=1S/C14H19NO2/c1-3-14(16)15-11-8-7-10-5-4-6-13(17-2)12(10)9-11/h4-6,11H,3,7-9H2,1-2H3,(H,15,16)
Reactome pathway
3n/an/an/an/an/an/an/an/a
Northwestern University
Curated by PDSP Ki Database
Naunyn Schmiedebergs Arch Pharmacol 355: 365-75 (1997)
Article DOI: 10.1007/pl00004956
BindingDB Entry DOI: 10.7270/Q2416VKF
Melatonin receptor
(Gallus gallus-Chick)
BDBM50045843
(8-M-PDOT | CHEMBL99377 | N-(8-Methoxy-1,2,3,4-tetr...)
Show SMILES CCC(=O)NC1CCc2cccc(OC)c2C1
Show InChI InChI=1S/C14H19NO2/c1-3-14(16)15-11-8-7-10-5-4-6-13(17-2)12(10)9-11/h4-6,11H,3,7-9H2,1-2H3,(H,15,16)
7.40n/an/an/an/an/an/an/an/a
University of Groningen
Curated by ChEMBL
Assay Description
Binding affinity to compete for 2-[125I]iodomelatonin binding to chicken retinal membranes
J Med Chem 36: 2891-8 (1993)
Article DOI: 10.1021/jm00072a008
BindingDB Entry DOI: 10.7270/Q2HT2RJK
Melatonin receptor
(Homo sapiens (Human))
BDBM50045843
(8-M-PDOT | CHEMBL99377 | N-(8-Methoxy-1,2,3,4-tetr...)
Show SMILES CCC(=O)NC1CCc2cccc(OC)c2C1
Show InChI InChI=1S/C14H19NO2/c1-3-14(16)15-11-8-7-10-5-4-6-13(17-2)12(10)9-11/h4-6,11H,3,7-9H2,1-2H3,(H,15,16)
Reactome pathway
60.2n/an/an/an/an/an/an/an/a
Northwestern University
Curated by PDSP Ki Database
Naunyn Schmiedebergs Arch Pharmacol 355: 365-75 (1997)
Article DOI: 10.1007/pl00004956
BindingDB Entry DOI: 10.7270/Q2416VKF
Melatonin receptor
(Homo sapiens (Human))
BDBM50045843
(8-M-PDOT | CHEMBL99377 | N-(8-Methoxy-1,2,3,4-tetr...)
Show SMILES CCC(=O)NC1CCc2cccc(OC)c2C1
Show InChI InChI=1S/C14H19NO2/c1-3-14(16)15-11-8-7-10-5-4-6-13(17-2)12(10)9-11/h4-6,11H,3,7-9H2,1-2H3,(H,15,16)
n/an/a 0.480n/an/an/an/an/an/a
University of Groningen
Curated by ChEMBL
Assay Description
Inhibition of 2-[125I]iodomelatonin stimulated calcium dependent dopamine release from the rabbit retina.
J Med Chem 36: 2891-8 (1993)
Article DOI: 10.1021/jm00072a008
BindingDB Entry DOI: 10.7270/Q2HT2RJK