BDBM50045873 3-[5-Chloro-2-(4-chloro-phenyl)-1H-indol-3-yl]-N,N-dipropyl-propionamide::CHEMBL100377
SMILES: CCCN(CCC)C(=O)CCc1c([nH]c2ccc(Cl)cc12)-c1ccc(Cl)cc1
InChI Key: InChIKey=CEQBAMJVNWVQBR-UHFFFAOYSA-N
Data: 1 KI  8 IC50
Activity Spreadsheet -- Enzyme Inhibition Constant Data from BindingDB
Found 9 hits for monomerid = 50045873
Trg + Lig
Ki
nM
ΔG°
kcal/mole
IC50
nM
Kd
nM
EC50/IC50
nM
koff
s-1
kon
M-1s-1
pHTemp
°C
Peripheral-Type Benzodiazepine Receptor
(Rattus norvegicus (rat))
BDBM50045873
(3-[5-Chloro-2-(4-chloro-phenyl)-1H-indol-3-yl]-N,N...)
Show SMILES CCCN(CCC)C(=O)CCc1c([nH]c2ccc(Cl)cc12)-c1ccc(Cl)cc1
Show InChI InChI=1S/C23H26Cl2N2O/c1-3-13-27(14-4-2)22(28)12-10-19-20-15-18(25)9-11-21(20)26-23(19)16-5-7-17(24)8-6-16/h5-9,11,15,26H,3-4,10,12-14H2,1-2H3
71n/an/an/an/an/an/an/an/a
Mayo Foundation for Medical Education and Research
Curated by ChEMBL
Assay Description
Binding affinity against mitochondrial DBI complex (peripheral benzodiazepine receptor) using primary cultures of glial cells
J Med Chem 36: 2908-20 (1993)
BindingDB Entry DOI: 10.7270/Q2C24VGV
Cannabinoid receptor 1
(Rattus norvegicus (rat))
BDBM50045873
(3-[5-Chloro-2-(4-chloro-phenyl)-1H-indol-3-yl]-N,N...)
Show SMILES CCCN(CCC)C(=O)CCc1c([nH]c2ccc(Cl)cc12)-c1ccc(Cl)cc1
Show InChI InChI=1S/C23H26Cl2N2O/c1-3-13-27(14-4-2)22(28)12-10-19-20-15-18(25)9-11-21(20)26-23(19)16-5-7-17(24)8-6-16/h5-9,11,15,26H,3-4,10,12-14H2,1-2H3
Reactome pathway
n/an/a>1.00E+3n/an/an/an/an/an/a
Mayo Foundation for Medical Education and Research
Curated by ChEMBL
Assay Description
Inhibitory activity, measured by displacement [3H]-CP-55,940 from cannabinoid receptor (CB1) in rat brain
J Med Chem 36: 2908-20 (1993)
BindingDB Entry DOI: 10.7270/Q2C24VGV
Serotonin 1 (5-HT1) receptor
(RAT-Rattus norvegicus (rat)-Rattus norvegicus (Rat...)
BDBM50045873
(3-[5-Chloro-2-(4-chloro-phenyl)-1H-indol-3-yl]-N,N...)
Show SMILES CCCN(CCC)C(=O)CCc1c([nH]c2ccc(Cl)cc12)-c1ccc(Cl)cc1
Show InChI InChI=1S/C23H26Cl2N2O/c1-3-13-27(14-4-2)22(28)12-10-19-20-15-18(25)9-11-21(20)26-23(19)16-5-7-17(24)8-6-16/h5-9,11,15,26H,3-4,10,12-14H2,1-2H3
n/an/a>1.00E+3n/an/an/an/an/an/a
Mayo Foundation for Medical Education and Research
Curated by ChEMBL
Assay Description
Inhibitory activity by measuring its ability to displace [3H]ketanserin from serotonin receptor in rat brain
J Med Chem 36: 2908-20 (1993)
BindingDB Entry DOI: 10.7270/Q2C24VGV
Adrenergic receptor alpha
(Rattus norvegicus (rat)-Rattus norvegicus (Rat)-RA...)
BDBM50045873
(3-[5-Chloro-2-(4-chloro-phenyl)-1H-indol-3-yl]-N,N...)
Show SMILES CCCN(CCC)C(=O)CCc1c([nH]c2ccc(Cl)cc12)-c1ccc(Cl)cc1
Show InChI InChI=1S/C23H26Cl2N2O/c1-3-13-27(14-4-2)22(28)12-10-19-20-15-18(25)9-11-21(20)26-23(19)16-5-7-17(24)8-6-16/h5-9,11,15,26H,3-4,10,12-14H2,1-2H3
n/an/a>1.00E+3n/an/an/an/an/an/a
Mayo Foundation for Medical Education and Research
Curated by ChEMBL
Assay Description
Inhibitory activity by measuring its ability to displace [3H]WB-4101 from alpha-adrenergic receptor in rat brain
J Med Chem 36: 2908-20 (1993)
BindingDB Entry DOI: 10.7270/Q2C24VGV
Opioid receptor
(Rattus norvegicus (rat)-RAT)
BDBM50045873
(3-[5-Chloro-2-(4-chloro-phenyl)-1H-indol-3-yl]-N,N...)
Show SMILES CCCN(CCC)C(=O)CCc1c([nH]c2ccc(Cl)cc12)-c1ccc(Cl)cc1
Show InChI InChI=1S/C23H26Cl2N2O/c1-3-13-27(14-4-2)22(28)12-10-19-20-15-18(25)9-11-21(20)26-23(19)16-5-7-17(24)8-6-16/h5-9,11,15,26H,3-4,10,12-14H2,1-2H3
Reactome pathway
n/an/a>1.00E+3n/an/an/an/an/an/a
Mayo Foundation for Medical Education and Research
Curated by ChEMBL
Assay Description
Tested for inhibitory activity by measuring its ability to displace [3H]3-PPP from opiate receptor in rat brain
J Med Chem 36: 2908-20 (1993)
BindingDB Entry DOI: 10.7270/Q2C24VGV
Adrenergic receptor alpha
(Rattus norvegicus (rat)-Rattus norvegicus (Rat)-RA...)
BDBM50045873
(3-[5-Chloro-2-(4-chloro-phenyl)-1H-indol-3-yl]-N,N...)
Show SMILES CCCN(CCC)C(=O)CCc1c([nH]c2ccc(Cl)cc12)-c1ccc(Cl)cc1
Show InChI InChI=1S/C23H26Cl2N2O/c1-3-13-27(14-4-2)22(28)12-10-19-20-15-18(25)9-11-21(20)26-23(19)16-5-7-17(24)8-6-16/h5-9,11,15,26H,3-4,10,12-14H2,1-2H3
n/an/a>1.00E+3n/an/an/an/an/an/a
Mayo Foundation for Medical Education and Research
Curated by ChEMBL
Assay Description
Inhibitory activity by measuring its ability to displace [3H]clonidine from alpha-adrenergic receptor in rat brain
J Med Chem 36: 2908-20 (1993)
BindingDB Entry DOI: 10.7270/Q2C24VGV
Opioid receptor
(Rattus norvegicus (rat)-RAT)
BDBM50045873
(3-[5-Chloro-2-(4-chloro-phenyl)-1H-indol-3-yl]-N,N...)
Show SMILES CCCN(CCC)C(=O)CCc1c([nH]c2ccc(Cl)cc12)-c1ccc(Cl)cc1
Show InChI InChI=1S/C23H26Cl2N2O/c1-3-13-27(14-4-2)22(28)12-10-19-20-15-18(25)9-11-21(20)26-23(19)16-5-7-17(24)8-6-16/h5-9,11,15,26H,3-4,10,12-14H2,1-2H3
Reactome pathway
n/an/a>1.00E+3n/an/an/an/an/an/a
Mayo Foundation for Medical Education and Research
Curated by ChEMBL
Assay Description
Inhibition of [3H]naxolone binding to opiate receptors in rat brain
J Med Chem 36: 2908-20 (1993)
BindingDB Entry DOI: 10.7270/Q2C24VGV
CCKBR
(RAT)
BDBM50045873
(3-[5-Chloro-2-(4-chloro-phenyl)-1H-indol-3-yl]-N,N...)
Show SMILES CCCN(CCC)C(=O)CCc1c([nH]c2ccc(Cl)cc12)-c1ccc(Cl)cc1
Show InChI InChI=1S/C23H26Cl2N2O/c1-3-13-27(14-4-2)22(28)12-10-19-20-15-18(25)9-11-21(20)26-23(19)16-5-7-17(24)8-6-16/h5-9,11,15,26H,3-4,10,12-14H2,1-2H3
n/an/a>1.00E+3n/an/an/an/an/an/a
Mayo Foundation for Medical Education and Research
Curated by ChEMBL
Assay Description
Inhibitory activity by measuring its ability to displace [3H]L-365,260 from cholecystokinin receptor in rat brain
J Med Chem 36: 2908-20 (1993)
BindingDB Entry DOI: 10.7270/Q2C24VGV
Adrenergic receptor beta
(Rattus norvegicus (Rat))
BDBM50045873
(3-[5-Chloro-2-(4-chloro-phenyl)-1H-indol-3-yl]-N,N...)
Show SMILES CCCN(CCC)C(=O)CCc1c([nH]c2ccc(Cl)cc12)-c1ccc(Cl)cc1
Show InChI InChI=1S/C23H26Cl2N2O/c1-3-13-27(14-4-2)22(28)12-10-19-20-15-18(25)9-11-21(20)26-23(19)16-5-7-17(24)8-6-16/h5-9,11,15,26H,3-4,10,12-14H2,1-2H3
n/an/a>1.00E+3n/an/an/an/an/an/a
Mayo Foundation for Medical Education and Research
Curated by ChEMBL
Assay Description
Inhibitory activity by measuring its ability to displace [125I]pindolol from beta-adrenergic receptor in rat brain
J Med Chem 36: 2908-20 (1993)
BindingDB Entry DOI: 10.7270/Q2C24VGV