BDBM50046033 CHEMBL3310128
SMILES: Fc1ccc(cc1)-c1n[nH]c(NC(=O)Cc2ccccc2)c1-c1ccncc1
InChI Key: InChIKey=BDSZOAWKWSYMDS-UHFFFAOYSA-N
Data: 1 IC50
Activity Spreadsheet -- Enzyme Inhibition Constant Data from BindingDB
Found 1 hit for monomerid = 50046033
Trg + Lig
Ki
nM
ΔG°
kcal/mole
IC50
nM
Kd
nM
EC50/IC50
nM
koff
s-1
kon
M-1s-1
pHTemp
°C
Mitogen-activated protein kinase 14
(Homo sapiens (Human))
BDBM50046033
(CHEMBL3310128)
Show SMILES Fc1ccc(cc1)-c1n[nH]c(NC(=O)Cc2ccccc2)c1-c1ccncc1
Show InChI InChI=1S/C22H17FN4O/c23-18-8-6-17(7-9-18)21-20(16-10-12-24-13-11-16)22(27-26-21)25-19(28)14-15-4-2-1-3-5-15/h1-13H,14H2,(H2,25,26,27,28)
NCI pathway
Reactome pathway
n/an/a 17n/an/an/an/an/an/a
ASKA Pharmaceutical Co., Ltd
Curated by ChEMBL
Assay Description
Inhibition of full length human p38alpha MAP kinase by Off-chip mobility shift assay
Bioorg Med Chem 22: 4162-76 (2014)
Article DOI: 10.1016/j.bmc.2014.05.045
BindingDB Entry DOI: 10.7270/Q2C82BXS