BDBM50046048 CHEMBL3310141
SMILES: Fc1ccc(cc1)-c1noc(NC(=O)Cc2ccccc2Cl)c1-c1ccncn1
InChI Key: InChIKey=JZLOFCLTDFXBCB-UHFFFAOYSA-N
Data: 1 IC50
Activity Spreadsheet -- Enzyme Inhibition Constant Data from BindingDB
Found 1 hit for monomerid = 50046048
Trg + Lig
Ki
nM
ΔG°
kcal/mole
IC50
nM
Kd
nM
EC50/IC50
nM
koff
s-1
kon
M-1s-1
pHTemp
°C
Mitogen-activated protein kinase 14
(Homo sapiens (Human))
BDBM50046048
(CHEMBL3310141)
Show SMILES Fc1ccc(cc1)-c1noc(NC(=O)Cc2ccccc2Cl)c1-c1ccncn1
Show InChI InChI=1S/C21H14ClFN4O2/c22-16-4-2-1-3-14(16)11-18(28)26-21-19(17-9-10-24-12-25-17)20(27-29-21)13-5-7-15(23)8-6-13/h1-10,12H,11H2,(H,26,28)
NCI pathway
Reactome pathway
n/an/a 6.90n/an/an/an/an/an/a
ASKA Pharmaceutical Co., Ltd
Curated by ChEMBL
Assay Description
Inhibition of full length human p38alpha MAP kinase by Off-chip mobility shift assay
Bioorg Med Chem 22: 4162-76 (2014)
Article DOI: 10.1016/j.bmc.2014.05.045
BindingDB Entry DOI: 10.7270/Q2C82BXS