BDBM50046049 CHEMBL3310142
SMILES: Fc1ccc(cc1)-c1noc(NC(=O)Cc2c(F)cccc2Cl)c1-c1ccncn1
InChI Key: InChIKey=OHMPXDCOVKOOAN-UHFFFAOYSA-N
Data: 4 IC50
Activity Spreadsheet -- Enzyme Inhibition Constant Data from BindingDB
Found 4 hits for monomerid = 50046049
Trg + Lig
Ki
nM
ΔG°
kcal/mole
IC50
nM
Kd
nM
EC50/IC50
nM
koff
s-1
kon
M-1s-1
pHTemp
°C
Mitogen-activated protein kinase 14
(Homo sapiens (Human))
BDBM50046049
(CHEMBL3310142)
Show SMILES Fc1ccc(cc1)-c1noc(NC(=O)Cc2c(F)cccc2Cl)c1-c1ccncn1
Show InChI InChI=1S/C21H13ClF2N4O2/c22-15-2-1-3-16(24)14(15)10-18(29)27-21-19(17-8-9-25-11-26-17)20(28-30-21)12-4-6-13(23)7-5-12/h1-9,11H,10H2,(H,27,29)
NCI pathway
Reactome pathway
n/an/a 11n/an/an/an/an/an/a
ASKA Pharmaceutical Co., Ltd
Curated by ChEMBL
Assay Description
Inhibition of full length human p38alpha MAP kinase by Off-chip mobility shift assay
Bioorg Med Chem 22: 4162-76 (2014)
Article DOI: 10.1016/j.bmc.2014.05.045
BindingDB Entry DOI: 10.7270/Q2C82BXS
Mitogen-activated protein kinase 10
(Homo sapiens (Human))
BDBM50046049
(CHEMBL3310142)
Show SMILES Fc1ccc(cc1)-c1noc(NC(=O)Cc2c(F)cccc2Cl)c1-c1ccncn1
Show InChI InChI=1S/C21H13ClF2N4O2/c22-15-2-1-3-16(24)14(15)10-18(29)27-21-19(17-8-9-25-11-26-17)20(28-30-21)12-4-6-13(23)7-5-12/h1-9,11H,10H2,(H,27,29)
NCI pathway
Reactome pathway
n/an/a 572n/an/an/an/an/an/a
ASKA Pharmaceutical Co., Ltd
Curated by ChEMBL
Assay Description
Inhibition of human JNK3 kinase by Off-chip mobility shift assay
Bioorg Med Chem 22: 4162-76 (2014)
Article DOI: 10.1016/j.bmc.2014.05.045
BindingDB Entry DOI: 10.7270/Q2C82BXS
Mitogen-activated protein kinase 9
(Homo sapiens (Human))
BDBM50046049
(CHEMBL3310142)
Show SMILES Fc1ccc(cc1)-c1noc(NC(=O)Cc2c(F)cccc2Cl)c1-c1ccncn1
Show InChI InChI=1S/C21H13ClF2N4O2/c22-15-2-1-3-16(24)14(15)10-18(29)27-21-19(17-8-9-25-11-26-17)20(28-30-21)12-4-6-13(23)7-5-12/h1-9,11H,10H2,(H,27,29)
NCI pathway
Reactome pathway
n/an/a 198n/an/an/an/an/an/a
ASKA Pharmaceutical Co., Ltd
Curated by ChEMBL
Assay Description
Inhibition of human JNK2 kinase by Off-chip mobility shift assay
Bioorg Med Chem 22: 4162-76 (2014)
Article DOI: 10.1016/j.bmc.2014.05.045
BindingDB Entry DOI: 10.7270/Q2C82BXS
Mitogen-activated protein kinase 11
(Homo sapiens (Human))
BDBM50046049
(CHEMBL3310142)
Show SMILES Fc1ccc(cc1)-c1noc(NC(=O)Cc2c(F)cccc2Cl)c1-c1ccncn1
Show InChI InChI=1S/C21H13ClF2N4O2/c22-15-2-1-3-16(24)14(15)10-18(29)27-21-19(17-8-9-25-11-26-17)20(28-30-21)12-4-6-13(23)7-5-12/h1-9,11H,10H2,(H,27,29)
Reactome pathway
n/an/a 326n/an/an/an/an/an/a
ASKA Pharmaceutical Co., Ltd
Curated by ChEMBL
Assay Description
Inhibition of human p38beta MAP kinase by Off-chip mobility shift assay
Bioorg Med Chem 22: 4162-76 (2014)
Article DOI: 10.1016/j.bmc.2014.05.045
BindingDB Entry DOI: 10.7270/Q2C82BXS