null
SMILES: CC(=O)Nc1ccc(cc1)S(=O)(=O)NNc1ccc(Br)c(F)c1
InChI Key: InChIKey=AWXCTQPLYRKQAR-UHFFFAOYSA-N
Activity Spreadsheet -- Enzyme Inhibition Constant Data from BindingDB
Found 2 hits for monomerid = 50046154
Trg + Lig
Ki
nM
ΔG°
kcal/mole
IC50
nM
Kd
nM
EC50/IC50
nM
koff
s-1
kon
M-1s-1
pHTemp
°C
Indoleamine 2,3-dioxygenase 1
(Homo sapiens (Human))
BDBM50046154
(CHEMBL3310859)
Show SMILES CC(=O)Nc1ccc(cc1)S(=O)(=O)NNc1ccc(Br)c(F)c1
Show InChI InChI=1S/C14H13BrFN3O3S/c1-9(20)17-10-2-5-12(6-3-10)23(21,22)19-18-11-4-7-13(15)14(16)8-11/h2-8,18-19H,1H3,(H,17,20)
Reactome pathway
n/an/a 205n/an/an/an/an/an/a
National Health Research Institutes
Curated by ChEMBL
Assay Description
Inhibition of human recombinant IDO expressed in Escherichia coli using N-formylkynurenine as substrate incubated for 1 hr prior to NaOH addition mea...
Bioorg Med Chem Lett 24: 3403-6 (2014)
Article DOI: 10.1016/j.bmcl.2014.05.084
BindingDB Entry DOI: 10.7270/Q23R0VH6
Indoleamine 2,3-dioxygenase 1
(Homo sapiens (Human))
BDBM50046154
(CHEMBL3310859)
Show SMILES CC(=O)Nc1ccc(cc1)S(=O)(=O)NNc1ccc(Br)c(F)c1
Show InChI InChI=1S/C14H13BrFN3O3S/c1-9(20)17-10-2-5-12(6-3-10)23(21,22)19-18-11-4-7-13(15)14(16)8-11/h2-8,18-19H,1H3,(H,17,20)
Reactome pathway
n/an/an/an/a 187n/an/an/an/a
National Health Research Institutes
Curated by ChEMBL
Assay Description
Inhibition of IDO in human HeLa cells after 24 hrs by spectrophotometry
Bioorg Med Chem Lett 24: 3403-6 (2014)
Article DOI: 10.1016/j.bmcl.2014.05.084
BindingDB Entry DOI: 10.7270/Q23R0VH6