null
SMILES: Nc1nc2cc(NCc3ccco3)[nH]c2c(=O)[nH]1
InChI Key: InChIKey=ZGYLCKDEKZLMCG-UHFFFAOYSA-N
Activity Spreadsheet -- Enzyme Inhibition Constant Data from BindingDB
Found 1 hit for monomerid = 50046216
Trg + Lig
Ki
nM
ΔG°
kcal/mole
IC50
nM
Kd
nM
EC50/IC50
nM
koff
s-1
kon
M-1s-1
pHTemp
°C
Purine nucleoside phosphorylase
(Homo sapiens (Human))
BDBM50046216
(2-Amino-6-[(furan-2-ylmethyl)-amino]-3,7-dihydro-p...)
Show SMILES Nc1nc2cc(NCc3ccco3)[nH]c2c(=O)[nH]1
Show InChI InChI=1S/C11H11N5O2/c12-11-14-7-4-8(15-9(7)10(17)16-11)13-5-6-2-1-3-18-6/h1-4,13,15H,5H2,(H3,12,14,16,17)
Reactome pathway
n/an/a 0.75n/an/an/an/an/an/a
BioCryst Pharmaceuticals, Inc.
Curated by ChEMBL
Assay Description
Inhibition of Purine nucleoside phosphorylase was evaluated against the enzyme from Human erythrocytic in 50 mM phosphate
J Med Chem 36: 55-69 (1993)
BindingDB Entry DOI: 10.7270/Q2B27TCX