BDBM50046236 2-Amino-8-thiophen-2-ylmethyl-1,9-dihydro-purin-6-one::CHEMBL159889
SMILES: Nc1nc2nc(Cc3cccs3)[nH]c2c(=O)[nH]1
InChI Key: InChIKey=QSCAOACNBNXUPQ-UHFFFAOYSA-N
Data: 1 IC50
Activity Spreadsheet -- Enzyme Inhibition Constant Data from BindingDB
Found 1 hit for monomerid = 50046236
Trg + Lig
Ki
nM
ΔG°
kcal/mole
IC50
nM
Kd
nM
EC50/IC50
nM
koff
s-1
kon
M-1s-1
pHTemp
°C
Purine nucleoside phosphorylase
(Homo sapiens (Human))
BDBM50046236
(2-Amino-8-thiophen-2-ylmethyl-1,9-dihydro-purin-6-...)
Show SMILES Nc1nc2nc(Cc3cccs3)[nH]c2c(=O)[nH]1
Show InChI InChI=1S/C10H9N5OS/c11-10-14-8-7(9(16)15-10)12-6(13-8)4-5-2-1-3-17-5/h1-3H,4H2,(H4,11,12,13,14,15,16)
Reactome pathway
n/an/a 11n/an/an/an/an/an/a
BioCryst Pharmaceuticals, Inc.
Curated by ChEMBL
Assay Description
Inhibition of Purine nucleoside phosphorylase was evaluated against the enzyme from Human erythrocytic in 50 mM phosphate
J Med Chem 36: 55-69 (1993)
BindingDB Entry DOI: 10.7270/Q2B27TCX