BDBM50046241 2-Amino-8-[(furan-2-ylmethyl)-amino]-1,9-dihydro-purin-6-one::CHEMBL351219
SMILES: Nc1nc2nc(NCc3ccco3)[nH]c2c(=O)[nH]1
InChI Key: InChIKey=XUPAYBISZXCGPW-UHFFFAOYSA-N
Data: 1 IC50
Activity Spreadsheet -- Enzyme Inhibition Constant Data from BindingDB
Found 1 hit for monomerid = 50046241
Trg + Lig
Ki
nM
ΔG°
kcal/mole
IC50
nM
Kd
nM
EC50/IC50
nM
koff
s-1
kon
M-1s-1
pHTemp
°C
Purine nucleoside phosphorylase
(Homo sapiens (Human))
BDBM50046241
(2-Amino-8-[(furan-2-ylmethyl)-amino]-1,9-dihydro-p...)
Show SMILES Nc1nc2nc(NCc3ccco3)[nH]c2c(=O)[nH]1
Show InChI InChI=1S/C10H10N6O2/c11-9-14-7-6(8(17)16-9)13-10(15-7)12-4-5-2-1-3-18-5/h1-3H,4H2,(H5,11,12,13,14,15,16,17)
Reactome pathway
n/an/a 0.25n/an/an/an/an/an/a
BioCryst Pharmaceuticals, Inc.
Curated by ChEMBL
Assay Description
Inhibition of Purine nucleoside phosphorylase was evaluated against the enzyme from Human erythrocytic in 50 mM phosphate
J Med Chem 36: 55-69 (1993)
BindingDB Entry DOI: 10.7270/Q2B27TCX