null
SMILES: Nc1nc2nc([nH]c2c(=O)[nH]1)-c1cccnc1
InChI Key: InChIKey=CYNGEGTWGBHJBB-UHFFFAOYSA-N
Activity Spreadsheet -- Enzyme Inhibition Constant Data from BindingDB
Found 1 hit for monomerid = 50046247
Trg + Lig
Ki
nM
ΔG°
kcal/mole
IC50
nM
Kd
nM
EC50/IC50
nM
koff
s-1
kon
M-1s-1
pHTemp
°C
Purine nucleoside phosphorylase
(Homo sapiens (Human))
BDBM50046247
(2-Amino-8-pyridin-3-yl-1,9-dihydro-purin-6-one | C...)
Show SMILES Nc1nc2nc([nH]c2c(=O)[nH]1)-c1cccnc1
Show InChI InChI=1S/C10H8N6O/c11-10-15-8-6(9(17)16-10)13-7(14-8)5-2-1-3-12-4-5/h1-4H,(H4,11,13,14,15,16,17)
Reactome pathway
n/an/a 57n/an/an/an/an/an/a
BioCryst Pharmaceuticals, Inc.
Curated by ChEMBL
Assay Description
Inhibition of Purine nucleoside phosphorylase was evaluated against the enzyme from Human erythrocytic in 50 mM phosphate
J Med Chem 36: 55-69 (1993)
BindingDB Entry DOI: 10.7270/Q2B27TCX