BDBM50046808 2-Benzyl-N*1*-[1-(1-cyclohexylmethyl-2,3-dihydroxy-5-methyl-hexylcarbamoyl)-2-pyrazol-1-yl-ethyl]-N*4*-methyl-N*4*-(2-pyridin-2-yl-ethyl)-succinamide::CHEMBL335338
SMILES: CC(C)C[C@H](O)[C@H](O)[C@H](CC1CCCCC1)NC(=O)[C@H](Cn1cccn1)NC(=O)[C@@H](CC(=O)N(C)CCc1ccccn1)Cc1ccccc1
InChI Key: InChIKey=LLQOKDMNSXHJQQ-ZHODSEKVSA-N
Data: 1 IC50
Activity Spreadsheet -- Enzyme Inhibition Constant Data from BindingDB
Found 1 hit for monomerid = 50046808
Trg + Lig
Ki
nM
ΔG°
kcal/mole
IC50
nM
Kd
nM
EC50/IC50
nM
koff
s-1
kon
M-1s-1
pHTemp
°C
Renin
(Homo sapiens (Human))
BDBM50046808
(2-Benzyl-N*1*-[1-(1-cyclohexylmethyl-2,3-dihydroxy...)
Show SMILES CC(C)C[C@H](O)[C@H](O)[C@H](CC1CCCCC1)NC(=O)[C@H](Cn1cccn1)NC(=O)[C@@H](CC(=O)N(C)CCc1ccccn1)Cc1ccccc1
Show InChI InChI=1S/C39H56N6O5/c1-28(2)23-35(46)37(48)33(25-30-15-8-5-9-16-30)42-39(50)34(27-45-21-12-20-41-45)43-38(49)31(24-29-13-6-4-7-14-29)26-36(47)44(3)22-18-32-17-10-11-19-40-32/h4,6-7,10-14,17,19-21,28,30-31,33-35,37,46,48H,5,8-9,15-16,18,22-27H2,1-3H3,(H,42,50)(H,43,49)/t31-,33+,34+,35+,37-/m1/s1
Reactome pathway
n/an/a 1.60n/an/an/an/a7.4n/a
Abbott Laboratories
Curated by ChEMBL
Assay Description
Inhibitory concentration against human plasma renin at pH 7.4
J Med Chem 36: 460-7 (1993)
BindingDB Entry DOI: 10.7270/Q2VT1R5C