BDBM50046910 4-(5-Amino-[1,3,4]thiadiazol-2-yl)-2,6-di-tert-butyl-phenol::CHEMBL417073
SMILES: CC(C)(C)c1cc(cc(c1O)C(C)(C)C)-c1nnc(N)s1
InChI Key: InChIKey=ZCHIJNKLPIPVGQ-UHFFFAOYSA-N
Data: 4 IC50
Activity Spreadsheet -- Enzyme Inhibition Constant Data from BindingDB
Found 4 hits for monomerid = 50046910
Trg + Lig
Ki
nM
ΔG°
kcal/mole
IC50
nM
Kd
nM
EC50/IC50
nM
koff
s-1
kon
M-1s-1
pHTemp
°C
Cyclooxygenase-1 (COX-1)
(Homo sapiens (Human))
BDBM50046910
(4-(5-Amino-[1,3,4]thiadiazol-2-yl)-2,6-di-tert-but...)
Show SMILES CC(C)(C)c1cc(cc(c1O)C(C)(C)C)-c1nnc(N)s1
Show InChI InChI=1S/C16H23N3OS/c1-15(2,3)10-7-9(13-18-19-14(17)21-13)8-11(12(10)20)16(4,5)6/h7-8,20H,1-6H3,(H2,17,19)
n/an/a 530n/an/an/an/an/an/a
Warner-Lambert Company
Curated by ChEMBL
Assay Description
IC50 value against Prostaglandin G/H synthase 1 of human platelet rich plasma
J Med Chem 42: 1161-9 (1999)
Article DOI: 10.1021/jm980570y
BindingDB Entry DOI: 10.7270/Q2154G6N
Arachidonate 5-lipoxygenase
(Rattus norvegicus)
BDBM50046910
(4-(5-Amino-[1,3,4]thiadiazol-2-yl)-2,6-di-tert-but...)
Show SMILES CC(C)(C)c1cc(cc(c1O)C(C)(C)C)-c1nnc(N)s1
Show InChI InChI=1S/C16H23N3OS/c1-15(2,3)10-7-9(13-18-19-14(17)21-13)8-11(12(10)20)16(4,5)6/h7-8,20H,1-6H3,(H2,17,19)
n/an/a 1.40E+3n/an/an/an/an/an/a
Warner-Lambert Company
Curated by ChEMBL
Assay Description
Inhibition of 5-lipoxygenase measured by the reduction of leukotriene B4 (LTB4) in intact basophilic rat leukemia cells
J Med Chem 36: 1090-9 (1993)
BindingDB Entry DOI: 10.7270/Q20P10PV
Cyclooxygenase-2 (COX-2)
(Mus musculus (Mouse))
BDBM50046910
(4-(5-Amino-[1,3,4]thiadiazol-2-yl)-2,6-di-tert-but...)
Show SMILES CC(C)(C)c1cc(cc(c1O)C(C)(C)C)-c1nnc(N)s1
Show InChI InChI=1S/C16H23N3OS/c1-15(2,3)10-7-9(13-18-19-14(17)21-13)8-11(12(10)20)16(4,5)6/h7-8,20H,1-6H3,(H2,17,19)
n/an/a 110n/an/an/an/an/an/a
Warner-Lambert Company
Curated by ChEMBL
Assay Description
IC50 value against Prostaglandin G/H synthase 2 of murine J774A.1 cell line
J Med Chem 42: 1161-9 (1999)
Article DOI: 10.1021/jm980570y
BindingDB Entry DOI: 10.7270/Q2154G6N
Cyclooxygenase
(Homo sapiens (Human))
BDBM50046910
(4-(5-Amino-[1,3,4]thiadiazol-2-yl)-2,6-di-tert-but...)
Show SMILES CC(C)(C)c1cc(cc(c1O)C(C)(C)C)-c1nnc(N)s1
Show InChI InChI=1S/C16H23N3OS/c1-15(2,3)10-7-9(13-18-19-14(17)21-13)8-11(12(10)20)16(4,5)6/h7-8,20H,1-6H3,(H2,17,19)
NCI pathway
Reactome pathway
n/an/a 3.50E+3n/an/an/an/an/an/a
Warner-Lambert Company
Curated by ChEMBL
Assay Description
Inhibition of recombinant human prostaglandin G/H synthase 2 (COX-2)
J Med Chem 42: 1161-9 (1999)
Article DOI: 10.1021/jm980570y
BindingDB Entry DOI: 10.7270/Q2154G6N