BDBM50046915 5-[2-(3,5-Di-tert-butyl-4-hydroxy-phenyl)-vinyl]-3H-[1,3,4]oxadiazole-2-thione::CHEMBL273941
SMILES: CC(C)(C)c1cc(C=Cc2nnc(S)o2)cc(c1O)C(C)(C)C
InChI Key: InChIKey=GSGJLFJLSJOIGJ-UHFFFAOYSA-N
Data: 1 IC50
Activity Spreadsheet -- Enzyme Inhibition Constant Data from BindingDB
Found 1 hit for monomerid = 50046915
Trg + Lig
Ki
nM
ΔG°
kcal/mole
IC50
nM
Kd
nM
EC50/IC50
nM
koff
s-1
kon
M-1s-1
pHTemp
°C
Arachidonate 5-lipoxygenase
(Rattus norvegicus)
BDBM50046915
(5-[2-(3,5-Di-tert-butyl-4-hydroxy-phenyl)-vinyl]-3...)
Show SMILES CC(C)(C)c1cc(C=Cc2nnc(S)o2)cc(c1O)C(C)(C)C |w:7.6|
Show InChI InChI=1S/C18H24N2O2S/c1-17(2,3)12-9-11(7-8-14-19-20-16(23)22-14)10-13(15(12)21)18(4,5)6/h7-10,21H,1-6H3,(H,20,23)
n/an/a 580n/an/an/an/an/an/a
Warner-Lambert Company
Curated by ChEMBL
Assay Description
Inhibition of 5-lipoxygenase measured by the reduction of leukotriene B4 (LTB4) in intact basophilic rat leukemia cells
J Med Chem 36: 1090-9 (1993)
BindingDB Entry DOI: 10.7270/Q20P10PV