BDBM50046953 PECTOLINARIN::Pectolinarin
SMILES: COc1ccc(cc1)-c1cc(=O)c2c(O)c(OC)c(O[C@@H]3O[C@H](CO[C@@H]4O[C@@H](C)[C@H](O)[C@@H](O)[C@H]4O)[C@@H](O)[C@H](O)[C@H]3O)cc2o1
InChI Key: InChIKey=DUXQKCCELUKXOE-CBBZIXHGSA-N
Data: 1 EC50
Activity Spreadsheet -- Enzyme Inhibition Constant Data from BindingDB
Found 1 hit for monomerid = 50046953
Trg + Lig
Ki
nM
ΔG°
kcal/mole
IC50
nM
Kd
nM
EC50/IC50
nM
koff
s-1
kon
M-1s-1
pHTemp
°C
Peroxisome proliferator-activated receptor gamma
(Mus musculus)
BDBM50046953
(PECTOLINARIN | Pectolinarin)
Show SMILES COc1ccc(cc1)-c1cc(=O)c2c(O)c(OC)c(O[C@@H]3O[C@H](CO[C@@H]4O[C@@H](C)[C@H](O)[C@@H](O)[C@H]4O)[C@@H](O)[C@H](O)[C@H]3O)cc2o1 |r|
Show InChI InChI=1S/C29H34O15/c1-11-20(31)23(34)25(36)28(41-11)40-10-18-21(32)24(35)26(37)29(44-18)43-17-9-16-19(22(33)27(17)39-3)14(30)8-15(42-16)12-4-6-13(38-2)7-5-12/h4-9,11,18,20-21,23-26,28-29,31-37H,10H2,1-3H3/t11-,18+,20-,21+,23+,24-,25+,26+,28+,29+/m0/s1
Reactome pathway
n/an/an/an/a>1.00E+5n/an/an/an/a
Institute of Chinese Materia Medica
Curated by ChEMBL
Assay Description
Agonist activity at mouse PPARgamma expressed in HEK293 cells co-expressing with Gal4 reporter vector after 24 hrs by dual-luciferase reporter assay
J Nat Prod 77: 1594-600 (2014)
Article DOI: 10.1021/np500150f
BindingDB Entry DOI: 10.7270/Q2D2208C