BDBM50047089 2-{3-[4-(5-Fluoro-1H-indol-3-yl)-3,6-dihydro-2H-pyridin-1-yl]-propyl}-2H-naphtho[1,8-cd]isothiazole 1,1-dioxide::CHEMBL18224
SMILES: Fc1ccc2[nH]cc(C3=CCN(CCCN4c5cccc6cccc(c56)S4(=O)=O)CC3)c2c1
InChI Key: InChIKey=BWNZLYUMFNUWCY-UHFFFAOYSA-N
Data: 2 IC50
Activity Spreadsheet -- Enzyme Inhibition Constant Data from BindingDB
Found 2 hits for monomerid = 50047089
Trg + Lig
Ki
nM
ΔG°
kcal/mole
IC50
nM
Kd
nM
EC50/IC50
nM
koff
s-1
kon
M-1s-1
pHTemp
°C
D(2) dopamine receptor
(Rattus norvegicus (rat))
BDBM50047089
(2-{3-[4-(5-Fluoro-1H-indol-3-yl)-3,6-dihydro-2H-py...)
Show SMILES Fc1ccc2[nH]cc(C3=CCN(CCCN4c5cccc6cccc(c56)S4(=O)=O)CC3)c2c1 |t:8|
Show InChI InChI=1S/C26H24FN3O2S/c27-20-8-9-23-21(16-20)22(17-28-23)18-10-14-29(15-11-18)12-3-13-30-24-6-1-4-19-5-2-7-25(26(19)24)33(30,31)32/h1-2,4-10,16-17,28H,3,11-15H2
Reactome pathway
n/an/a 13n/an/an/an/an/an/a
Centre de Recherches de Vitry-Alfortville
Curated by ChEMBL
Assay Description
Binding affinity at dopamine receptor D2 by the inhibition of binding to [3H]-spiperone in rat striatal membranes
J Med Chem 36: 1194-202 (1993)
BindingDB Entry DOI: 10.7270/Q2MC8Z3Z
Sodium-dependent serotonin transporter
(Rattus norvegicus (rat))
BDBM50047089
(2-{3-[4-(5-Fluoro-1H-indol-3-yl)-3,6-dihydro-2H-py...)
Show SMILES Fc1ccc2[nH]cc(C3=CCN(CCCN4c5cccc6cccc(c56)S4(=O)=O)CC3)c2c1 |t:8|
Show InChI InChI=1S/C26H24FN3O2S/c27-20-8-9-23-21(16-20)22(17-28-23)18-10-14-29(15-11-18)12-3-13-30-24-6-1-4-19-5-2-7-25(26(19)24)33(30,31)32/h1-2,4-10,16-17,28H,3,11-15H2
n/an/a 0.300n/an/an/an/an/an/a
Centre de Recherches de Vitry-Alfortville
Curated by ChEMBL
Assay Description
Inhibition of [3H]-peroxitine binding to rat cortical membranes as measure of inhibitory activity towards 5-HT uptake
J Med Chem 36: 1194-202 (1993)
BindingDB Entry DOI: 10.7270/Q2MC8Z3Z