BDBM50047112 2-Methyl-6-propyl-4-[2'-(1H-tetrazol-5-yl)-biphenyl-4-ylmethoxy]-nicotinic acid methyl ester::CHEMBL21968
SMILES: CCCc1cc(OCc2ccc(cc2)-c2ccccc2-c2nnn[nH]2)c(C(=O)OC)c(C)n1
InChI Key: InChIKey=MUSXBIJEYLWDHR-UHFFFAOYSA-N
Data: 1 IC50
Activity Spreadsheet -- Enzyme Inhibition Constant Data from BindingDB
Found 1 hit for monomerid = 50047112
Trg + Lig
Ki
nM
ΔG°
kcal/mole
IC50
nM
Kd
nM
EC50/IC50
nM
koff
s-1
kon
M-1s-1
pHTemp
°C
Type-1 angiotensin II receptor
(Cavia porcellus)
BDBM50047112
(2-Methyl-6-propyl-4-[2'-(1H-tetrazol-5-yl)-bipheny...)
Show SMILES CCCc1cc(OCc2ccc(cc2)-c2ccccc2-c2nnn[nH]2)c(C(=O)OC)c(C)n1
Show InChI InChI=1S/C25H25N5O3/c1-4-7-19-14-22(23(16(2)26-19)25(31)32-3)33-15-17-10-12-18(13-11-17)20-8-5-6-9-21(20)24-27-29-30-28-24/h5-6,8-14H,4,7,15H2,1-3H3,(H,27,28,29,30)
n/an/a 9n/an/an/an/an/an/a
ZENECA Pharmaceuticals
Curated by ChEMBL
Assay Description
Inhibition of [125I]-Angiotensin binding to a guinea pig adrenal membrane preparation which corresponds to Angiotensin II receptor, type 1
J Med Chem 36: 1245-54 (1993)
BindingDB Entry DOI: 10.7270/Q2GM86CM