BDBM50047119 3-Benzyl-2,6-dimethyl-4-[2'-(1H-tetrazol-5-yl)-biphenyl-4-ylmethoxy]-pyridine::CHEMBL23006
SMILES: Cc1cc(OCc2ccc(cc2)-c2ccccc2-c2nnn[nH]2)c(Cc2ccccc2)c(C)n1
InChI Key: InChIKey=WQPUSSFOHANZLH-UHFFFAOYSA-N
Data: 1 IC50
Activity Spreadsheet -- Enzyme Inhibition Constant Data from BindingDB
Found 1 hit for monomerid = 50047119
Trg + Lig
Ki
nM
ΔG°
kcal/mole
IC50
nM
Kd
nM
EC50/IC50
nM
koff
s-1
kon
M-1s-1
pHTemp
°C
Type-1 angiotensin II receptor
(Cavia porcellus)
BDBM50047119
(3-Benzyl-2,6-dimethyl-4-[2'-(1H-tetrazol-5-yl)-bip...)
Show SMILES Cc1cc(OCc2ccc(cc2)-c2ccccc2-c2nnn[nH]2)c(Cc2ccccc2)c(C)n1
Show InChI InChI=1S/C28H25N5O/c1-19-16-27(26(20(2)29-19)17-21-8-4-3-5-9-21)34-18-22-12-14-23(15-13-22)24-10-6-7-11-25(24)28-30-32-33-31-28/h3-16H,17-18H2,1-2H3,(H,30,31,32,33)
n/an/a 14n/an/an/an/an/an/a
ZENECA Pharmaceuticals
Curated by ChEMBL
Assay Description
Inhibition of [125I]-Angiotensin binding to a guinea pig adrenal membrane preparation which corresponds to Angiotensin II receptor, type 1
J Med Chem 36: 1245-54 (1993)
BindingDB Entry DOI: 10.7270/Q2GM86CM