BDBM50047424 CHEMBL3319401
SMILES: CCN(CC)CCCS(=O)(=O)c1ccc2nc(NC(=O)NC(=O)c3cc(ccc3Cl)-n3cccn3)sc2c1
InChI Key: InChIKey=ZAYMZXZYGWQBMX-UHFFFAOYSA-N
Data: 1 IC50
Activity Spreadsheet -- Enzyme Inhibition Constant Data from BindingDB
Found 1 hit for monomerid = 50047424
Trg + Lig
Ki
nM
ΔG°
kcal/mole
IC50
nM
Kd
nM
EC50/IC50
nM
koff
s-1
kon
M-1s-1
pHTemp
°C
Ghrelin receptor
(Homo sapiens (Human))
BDBM50047424
(CHEMBL3319401)
Show SMILES CCN(CC)CCCS(=O)(=O)c1ccc2nc(NC(=O)NC(=O)c3cc(ccc3Cl)-n3cccn3)sc2c1
Show InChI InChI=1S/C25H27ClN6O4S2/c1-3-31(4-2)12-6-14-38(35,36)18-8-10-21-22(16-18)37-25(28-21)30-24(34)29-23(33)19-15-17(7-9-20(19)26)32-13-5-11-27-32/h5,7-11,13,15-16H,3-4,6,12,14H2,1-2H3,(H2,28,29,30,33,34)
Reactome pathway
n/an/a 3.90n/an/an/an/an/an/a
AstraZeneca
Curated by ChEMBL
Assay Description
Displacement of [125I]human ghrelin from human GHS-R1a expressed in HEK cell membranes after 60 mins by gamma counting method
J Med Chem 57: 6128-40 (2014)
Article DOI: 10.1021/jm500610n
BindingDB Entry DOI: 10.7270/Q279469X