BDBM50047429 CHEMBL3319398
SMILES: CN1CCN(CCCS(=O)(=O)c2ccc3nc(NC(=O)NC(=O)c4cc(N5CCCC5)c(cc4Cl)C#N)sc3c2)CC1
InChI Key: InChIKey=LYDCAFZYUYDFDM-UHFFFAOYSA-N
Data: 1 IC50
Activity Spreadsheet -- Enzyme Inhibition Constant Data from BindingDB
Found 1 hit for monomerid = 50047429
Trg + Lig
Ki
nM
ΔG°
kcal/mole
IC50
nM
Kd
nM
EC50/IC50
nM
koff
s-1
kon
M-1s-1
pHTemp
°C
Ghrelin receptor
(Homo sapiens (Human))
BDBM50047429
(CHEMBL3319398)
Show SMILES CN1CCN(CCCS(=O)(=O)c2ccc3nc(NC(=O)NC(=O)c4cc(N5CCCC5)c(cc4Cl)C#N)sc3c2)CC1
Show InChI InChI=1S/C28H32ClN7O4S2/c1-34-10-12-35(13-11-34)7-4-14-42(39,40)20-5-6-23-25(16-20)41-28(31-23)33-27(38)32-26(37)21-17-24(36-8-2-3-9-36)19(18-30)15-22(21)29/h5-6,15-17H,2-4,7-14H2,1H3,(H2,31,32,33,37,38)
Reactome pathway
n/an/a 0.240n/an/an/an/an/an/a
AstraZeneca
Curated by ChEMBL
Assay Description
Displacement of [125I]human ghrelin from human GHS-R1a expressed in HEK cell membranes after 60 mins by gamma counting method
J Med Chem 57: 6128-40 (2014)
Article DOI: 10.1021/jm500610n
BindingDB Entry DOI: 10.7270/Q279469X