BDBM50047483 CHEMBL3319219
SMILES: CN1CCN(CCCS(=O)(=O)c2ccc3nc(NC(=O)NC(=O)c4cc(ccc4Cl)C4CC4)sc3c2)CC1
InChI Key: InChIKey=PUILZEPLTAGZCO-UHFFFAOYSA-N
Data: 1 IC50
Activity Spreadsheet -- Enzyme Inhibition Constant Data from BindingDB
Found 1 hit for monomerid = 50047483
Trg + Lig
Ki
nM
ΔG°
kcal/mole
IC50
nM
Kd
nM
EC50/IC50
nM
koff
s-1
kon
M-1s-1
pHTemp
°C
Ghrelin receptor
(Homo sapiens (Human))
BDBM50047483
(CHEMBL3319219)
Show SMILES CN1CCN(CCCS(=O)(=O)c2ccc3nc(NC(=O)NC(=O)c4cc(ccc4Cl)C4CC4)sc3c2)CC1
Show InChI InChI=1S/C26H30ClN5O4S2/c1-31-10-12-32(13-11-31)9-2-14-38(35,36)19-6-8-22-23(16-19)37-26(28-22)30-25(34)29-24(33)20-15-18(17-3-4-17)5-7-21(20)27/h5-8,15-17H,2-4,9-14H2,1H3,(H2,28,29,30,33,34)
Reactome pathway
n/an/a 0.330n/an/an/an/an/an/a
AstraZeneca
Curated by ChEMBL
Assay Description
Displacement of [125I]human ghrelin from human GHS-R1a expressed in HEK cell membranes after 60 mins by gamma counting method
J Med Chem 57: 6128-40 (2014)
Article DOI: 10.1021/jm500610n
BindingDB Entry DOI: 10.7270/Q279469X