BDBM50047776 2-{[Acetyl-(3-tert-butyl-4-tetradecyloxy-benzoyl)-amino]-methyl}-1-methyl-pyridinium; iodide::CHEMBL154282
SMILES: CCCCCCCCCCCCCCOc1ccc(cc1C(C)(C)C)C(=O)N(Cc1cccc[n+]1C)C(C)=O
InChI Key: InChIKey=WLYUFJWHMUIUPG-UHFFFAOYSA-N
Data: 1 IC50
Activity Spreadsheet -- Enzyme Inhibition Constant Data from BindingDB
Found 1 hit for monomerid = 50047776
Trg + Lig
Ki
nM
ΔG°
kcal/mole
IC50
nM
Kd
nM
EC50/IC50
nM
koff
s-1
kon
M-1s-1
pHTemp
°C
Platelet activating factor receptor
(Cavia porcellus)
BDBM50047776
(2-{[Acetyl-(3-tert-butyl-4-tetradecyloxy-benzoyl)-...)
Show SMILES CCCCCCCCCCCCCCOc1ccc(cc1C(C)(C)C)C(=O)N(Cc1cccc[n+]1C)C(C)=O
Show InChI InChI=1S/C34H53N2O3/c1-7-8-9-10-11-12-13-14-15-16-17-20-25-39-32-23-22-29(26-31(32)34(3,4)5)33(38)36(28(2)37)27-30-21-18-19-24-35(30)6/h18-19,21-24,26H,7-17,20,25,27H2,1-6H3/q+1
Reactome pathway
n/an/a 22n/an/an/an/an/an/a
American Cyanamid Company
Curated by ChEMBL
Assay Description
Inhibition of PAF-induced platelet aggregation in rabbit platelet rich plasma
J Med Chem 36: 580-90 (1993)
BindingDB Entry DOI: 10.7270/Q2SX6C9X