BDBM50048186 CHEMBL3310791
SMILES: CC(C)(Sc1nc(O)c(C#N)c(n1)C1CC1)c1ccccc1
InChI Key: InChIKey=XIJWSHQVKGUTRE-UHFFFAOYSA-N
Data: 1 IC50
Activity Spreadsheet -- Enzyme Inhibition Constant Data from BindingDB
Found 1 hit for monomerid = 50048186
Trg + Lig
Ki
nM
ΔG°
kcal/mole
IC50
nM
Kd
nM
EC50/IC50
nM
koff
s-1
kon
M-1s-1
pHTemp
°C
C-X-C chemokine receptor type 2
(Homo sapiens (Human))
BDBM50048186
(CHEMBL3310791)
Show SMILES CC(C)(Sc1nc(O)c(C#N)c(n1)C1CC1)c1ccccc1
Show InChI InChI=1S/C17H17N3OS/c1-17(2,12-6-4-3-5-7-12)22-16-19-14(11-8-9-11)13(10-18)15(21)20-16/h3-7,11H,8-9H2,1-2H3,(H,19,20,21)
Reactome pathway
n/an/a 6.40E+3n/an/an/an/an/an/a
Novartis Institutes for BioMedical Research
Curated by ChEMBL
Assay Description
Antagonist activity against human recombinant CXCR2 receptor expressed in CHO cell membranes by SPA based [35S]GTPgammaS binding assay
Bioorg Med Chem Lett 24: 3285-90 (2014)
Article DOI: 10.1016/j.bmcl.2014.06.011
BindingDB Entry DOI: 10.7270/Q2930VTJ