BDBM50048198 CHEMBL356940::N-[6-(4-Fluoro-phenylsulfanyl)-1-oxo-indan-5-yl]-methanesulfonamide
SMILES: CS(=O)(=O)Nc1cc2CCC(=O)c2cc1Sc1ccc(F)cc1
InChI Key: InChIKey=RKELTGFGNOTWPJ-UHFFFAOYSA-N
Data: 2 IC50
Activity Spreadsheet -- Enzyme Inhibition Constant Data from BindingDB
Found 2 hits for monomerid = 50048198
Trg + Lig
Ki
nM
ΔG°
kcal/mole
IC50
nM
Kd
nM
EC50/IC50
nM
koff
s-1
kon
M-1s-1
pHTemp
°C
Cyclooxygenase
(Homo sapiens (Human))
BDBM50048198
(CHEMBL356940 | N-[6-(4-Fluoro-phenylsulfanyl)-1-ox...)
Show SMILES CS(=O)(=O)Nc1cc2CCC(=O)c2cc1Sc1ccc(F)cc1
Show InChI InChI=1S/C16H14FNO3S2/c1-23(20,21)18-14-8-10-2-7-15(19)13(10)9-16(14)22-12-5-3-11(17)4-6-12/h3-6,8-9,18H,2,7H2,1H3
NCI pathway
Reactome pathway
n/an/a 1.00E+3n/an/an/an/an/an/a
Merck Frosst Centre for Therapeutic Research
Curated by ChEMBL
Assay Description
In vitro inhibition of prostaglandin G/H synthase 2 expressed in human osteosarcoma 143 cells
J Med Chem 38: 4897-905 (1996)
BindingDB Entry DOI: 10.7270/Q28051PC
Cyclooxygenase-1 (COX-1)
(Homo sapiens (Human))
BDBM50048198
(CHEMBL356940 | N-[6-(4-Fluoro-phenylsulfanyl)-1-ox...)
Show SMILES CS(=O)(=O)Nc1cc2CCC(=O)c2cc1Sc1ccc(F)cc1
Show InChI InChI=1S/C16H14FNO3S2/c1-23(20,21)18-14-8-10-2-7-15(19)13(10)9-16(14)22-12-5-3-11(17)4-6-12/h3-6,8-9,18H,2,7H2,1H3
n/an/a>5.00E+4n/an/an/an/an/an/a
Merck Frosst Centre for Therapeutic Research
Curated by ChEMBL
Assay Description
Inhibition of Prostaglandin G/H synthase 1 in human U937 cells
J Med Chem 38: 4897-905 (1996)
BindingDB Entry DOI: 10.7270/Q28051PC