BDBM50048226 CHEMBL3311397
SMILES: Oc1nc(SCc2cccc(F)c2F)nc(C2CC2)c1I
InChI Key: InChIKey=QTMVXUSWYMABHD-UHFFFAOYSA-N
Data: 1 IC50
Activity Spreadsheet -- Enzyme Inhibition Constant Data from BindingDB
Found 1 hit for monomerid = 50048226
Trg + Lig
Ki
nM
ΔG°
kcal/mole
IC50
nM
Kd
nM
EC50/IC50
nM
koff
s-1
kon
M-1s-1
pHTemp
°C
C-X-C chemokine receptor type 2
(Homo sapiens (Human))
BDBM50048226
(CHEMBL3311397)
Show SMILES Oc1nc(SCc2cccc(F)c2F)nc(C2CC2)c1I
Show InChI InChI=1S/C14H11F2IN2OS/c15-9-3-1-2-8(10(9)16)6-21-14-18-12(7-4-5-7)11(17)13(20)19-14/h1-3,7H,4-6H2,(H,18,19,20)
Reactome pathway
n/an/a 3.20E+3n/an/an/an/an/an/a
Novartis Institutes for BioMedical Research
Curated by ChEMBL
Assay Description
Antagonist activity against human recombinant CXCR2 receptor expressed in CHO cell membranes by SPA based [35S]GTPgammaS binding assay
Bioorg Med Chem Lett 24: 3285-90 (2014)
Article DOI: 10.1016/j.bmcl.2014.06.011
BindingDB Entry DOI: 10.7270/Q2930VTJ