BDBM50048253 CHEMBL3310781
SMILES: Oc1nc(SCc2cccc(F)c2F)nc(C2CCCC2)c1C#N
InChI Key: InChIKey=KONQCJXYAZZYDA-UHFFFAOYSA-N
Data: 1 IC50
Activity Spreadsheet -- Enzyme Inhibition Constant Data from BindingDB
Found 1 hit for monomerid = 50048253
Trg + Lig
Ki
nM
ΔG°
kcal/mole
IC50
nM
Kd
nM
EC50/IC50
nM
koff
s-1
kon
M-1s-1
pHTemp
°C
C-X-C chemokine receptor type 2
(Homo sapiens (Human))
BDBM50048253
(CHEMBL3310781)
Show SMILES Oc1nc(SCc2cccc(F)c2F)nc(C2CCCC2)c1C#N
Show InChI InChI=1S/C17H15F2N3OS/c18-13-7-3-6-11(14(13)19)9-24-17-21-15(10-4-1-2-5-10)12(8-20)16(23)22-17/h3,6-7,10H,1-2,4-5,9H2,(H,21,22,23)
Reactome pathway
n/an/a 4.90E+3n/an/an/an/an/an/a
Novartis Institutes for BioMedical Research
Curated by ChEMBL
Assay Description
Antagonist activity against human recombinant CXCR2 receptor expressed in CHO cell membranes by SPA based [35S]GTPgammaS binding assay
Bioorg Med Chem Lett 24: 3285-90 (2014)
Article DOI: 10.1016/j.bmcl.2014.06.011
BindingDB Entry DOI: 10.7270/Q2930VTJ