BDBM50048291 6-(3-Adamantan-1-yl-4-hydroxy-phenyl)-naphthalene-2-carboxylic acid::6-[3'-(1-adamantyl)-4'-hydroxyphenyl]-2-naphthalenecarboxylic acid::6-[3'-(1-adamantyl)-4'-hydroxyphenyl]-2-naphthoic acid::CHEMBL1180::O-Demethylated Adapalene
SMILES: OC(=O)c1ccc2cc(ccc2c1)-c1ccc(O)c(c1)C12CC3CC(CC(C3)C1)C2
InChI Key: InChIKey=LDGIHZJOIQSHPB-UHFFFAOYSA-N
Data: 3 KI  3 EC50
PDB links: 1 PDB ID matches this monomer.
Activity Spreadsheet -- Enzyme Inhibition Constant Data from BindingDB
Found 6 hits for monomerid = 50048291
Trg + Lig
Ki
nM
ΔG°
kcal/mole
IC50
nM
Kd
nM
EC50/IC50
nM
koff
s-1
kon
M-1s-1
pHTemp
°C
Retinoid receptor
(Homo sapiens (Human))
BDBM50048291
(6-(3-Adamantan-1-yl-4-hydroxy-phenyl)-naphthalene-...)
Show SMILES OC(=O)c1ccc2cc(ccc2c1)-c1ccc(O)c(c1)C12CC3CC(CC(C3)C1)C2 |TLB:18:20:23:27.26.25,THB:21:22:25:29.20.28,21:20:23.22.27:25,28:20:23:27.26.25,28:26:23:29.21.20|
Show InChI InChI=1S/C27H26O3/c28-25-6-5-22(20-1-2-21-11-23(26(29)30)4-3-19(21)10-20)12-24(25)27-13-16-7-17(14-27)9-18(8-16)15-27/h1-6,10-12,16-18,28H,7-9,13-15H2,(H,29,30)
Reactome pathway
77n/an/an/an/an/an/an/an/a
CIRD GALDERMA
Curated by ChEMBL
Assay Description
Binding affinity to retinoic acid receptor (RAR) gamma using [3H]-CD 367 as radioligand
J Med Chem 38: 4993-5006 (1996)
BindingDB Entry DOI: 10.7270/Q20G3J8S
3D
3D Structure (crystal)
Retinoid receptor
(Homo sapiens (Human))
BDBM50048291
(6-(3-Adamantan-1-yl-4-hydroxy-phenyl)-naphthalene-...)
Show SMILES OC(=O)c1ccc2cc(ccc2c1)-c1ccc(O)c(c1)C12CC3CC(CC(C3)C1)C2 |TLB:18:20:23:27.26.25,THB:21:22:25:29.20.28,21:20:23.22.27:25,28:20:23:27.26.25,28:26:23:29.21.20|
Show InChI InChI=1S/C27H26O3/c28-25-6-5-22(20-1-2-21-11-23(26(29)30)4-3-19(21)10-20)12-24(25)27-13-16-7-17(14-27)9-18(8-16)15-27/h1-6,10-12,16-18,28H,7-9,13-15H2,(H,29,30)
Reactome pathway
2.48E+3n/an/an/an/an/an/an/an/a
CIRD GALDERMA
Curated by ChEMBL
Assay Description
Binding affinity to retinoic acid receptor beta using [3H]-CD 367 as radioligand
J Med Chem 38: 4993-5006 (1996)
BindingDB Entry DOI: 10.7270/Q20G3J8S
Retinoid X receptor gamma/retinoic acid receptor alpha
(Homo sapiens (Human))
BDBM50048291
(6-(3-Adamantan-1-yl-4-hydroxy-phenyl)-naphthalene-...)
Show SMILES OC(=O)c1ccc2cc(ccc2c1)-c1ccc(O)c(c1)C12CC3CC(CC(C3)C1)C2 |TLB:18:20:23:27.26.25,THB:21:22:25:29.20.28,21:20:23.22.27:25,28:20:23:27.26.25,28:26:23:29.21.20|
Show InChI InChI=1S/C27H26O3/c28-25-6-5-22(20-1-2-21-11-23(26(29)30)4-3-19(21)10-20)12-24(25)27-13-16-7-17(14-27)9-18(8-16)15-27/h1-6,10-12,16-18,28H,7-9,13-15H2,(H,29,30)
NCI pathway
Reactome pathway
6.50E+3n/an/an/an/an/an/an/an/a
CIRD GALDERMA
Curated by ChEMBL
Assay Description
Binding affinity to retinoic acid receptor alpha using [3H]-CD 367 as radioligand
J Med Chem 38: 4993-5006 (1996)
BindingDB Entry DOI: 10.7270/Q20G3J8S
Retinoic acid receptor RXR-alpha/Retinoic acid receptor beta
(Homo sapiens (Human))
BDBM50048291
(6-(3-Adamantan-1-yl-4-hydroxy-phenyl)-naphthalene-...)
Show SMILES OC(=O)c1ccc2cc(ccc2c1)-c1ccc(O)c(c1)C12CC3CC(CC(C3)C1)C2 |TLB:18:20:23:27.26.25,THB:21:22:25:29.20.28,21:20:23.22.27:25,28:20:23:27.26.25,28:26:23:29.21.20|
Show InChI InChI=1S/C27H26O3/c28-25-6-5-22(20-1-2-21-11-23(26(29)30)4-3-19(21)10-20)12-24(25)27-13-16-7-17(14-27)9-18(8-16)15-27/h1-6,10-12,16-18,28H,7-9,13-15H2,(H,29,30)
Reactome pathway
n/an/an/an/a 226n/an/an/an/a
Nestle Skin Health
Curated by ChEMBL
Assay Description
Agonist activity at GAL4 DNA-binding domain-tagged RARbeta (unknown origin) ligand-binding domain expressed in human HG5LN cells incubated for 18 hrs...
Bioorg Med Chem Lett 28: 1736-1741 (2018)
Article DOI: 10.1016/j.bmcl.2018.04.036
BindingDB Entry DOI: 10.7270/Q2N300JQ
Retinoic acid receptor RXR-alpha/gamma
(Homo sapiens (Human))
BDBM50048291
(6-(3-Adamantan-1-yl-4-hydroxy-phenyl)-naphthalene-...)
Show SMILES OC(=O)c1ccc2cc(ccc2c1)-c1ccc(O)c(c1)C12CC3CC(CC(C3)C1)C2 |TLB:18:20:23:27.26.25,THB:21:22:25:29.20.28,21:20:23.22.27:25,28:20:23:27.26.25,28:26:23:29.21.20|
Show InChI InChI=1S/C27H26O3/c28-25-6-5-22(20-1-2-21-11-23(26(29)30)4-3-19(21)10-20)12-24(25)27-13-16-7-17(14-27)9-18(8-16)15-27/h1-6,10-12,16-18,28H,7-9,13-15H2,(H,29,30)
Reactome pathway
n/an/an/an/a 49n/an/an/an/a
Nestle Skin Health
Curated by ChEMBL
Assay Description
Agonist activity at GAL4 DNA-binding domain-tagged RARgamma (unknown origin) ligand-binding domain expressed in human HG5LN cells incubated for 18 hr...
Bioorg Med Chem Lett 28: 1736-1741 (2018)
Article DOI: 10.1016/j.bmcl.2018.04.036
BindingDB Entry DOI: 10.7270/Q2N300JQ
3D
3D Structure (crystal)
Retinoic acid receptor alpha/Retinoid X receptor alpha
(Homo sapiens (Human))
BDBM50048291
(6-(3-Adamantan-1-yl-4-hydroxy-phenyl)-naphthalene-...)
Show SMILES OC(=O)c1ccc2cc(ccc2c1)-c1ccc(O)c(c1)C12CC3CC(CC(C3)C1)C2 |TLB:18:20:23:27.26.25,THB:21:22:25:29.20.28,21:20:23.22.27:25,28:20:23:27.26.25,28:26:23:29.21.20|
Show InChI InChI=1S/C27H26O3/c28-25-6-5-22(20-1-2-21-11-23(26(29)30)4-3-19(21)10-20)12-24(25)27-13-16-7-17(14-27)9-18(8-16)15-27/h1-6,10-12,16-18,28H,7-9,13-15H2,(H,29,30)
NCI pathway
Reactome pathway
n/an/an/an/a>1.00E+4n/an/an/an/a
Nestle Skin Health
Curated by ChEMBL
Assay Description
Agonist activity at GAL4 DNA-binding domain-tagged RARalpha (unknown origin) ligand-binding domain expressed in human HG5LN cells incubated for 18 hr...
Bioorg Med Chem Lett 28: 1736-1741 (2018)
Article DOI: 10.1016/j.bmcl.2018.04.036
BindingDB Entry DOI: 10.7270/Q2N300JQ