BDBM50048329 CHEMBL3315051::US9593113, Example 8
SMILES: CC(=O)NC(=O)C(C)(C)[C@@H]1c2ccc(nc2Oc2c(F)cccc12)-c1ccc(cc1)C(=O)N1CCCC1
InChI Key: InChIKey=NAYFBOYXQBLIBL-DEOSSOPVSA-N
Data: 3 KI  4 EC50
Activity Spreadsheet -- Enzyme Inhibition Constant Data from BindingDB
Found 7 hits for monomerid = 50048329
Trg + Lig
Ki
nM
ΔG°
kcal/mole
IC50
nM
Kd
nM
EC50/IC50
nM
koff
s-1
kon
M-1s-1
pHTemp
°C
Glucocorticoid receptor
(Homo sapiens (Human))
BDBM50048329
(CHEMBL3315051 | US9593113, Example 8)
Show SMILES CC(=O)NC(=O)C(C)(C)[C@@H]1c2ccc(nc2Oc2c(F)cccc12)-c1ccc(cc1)C(=O)N1CCCC1 |r|
Show InChI InChI=1S/C29H28FN3O4/c1-17(34)31-28(36)29(2,3)24-20-7-6-8-22(30)25(20)37-26-21(24)13-14-23(32-26)18-9-11-19(12-10-18)27(35)33-15-4-5-16-33/h6-14,24H,4-5,15-16H2,1-3H3,(H,31,34,36)/t24-/m0/s1
2.5n/an/an/an/an/an/an/an/a
Bristol-Myers Squibb Company
Curated by ChEMBL
Assay Description
Binding affinity to glucocorticoid receptor (unknown origin) by fluorescence polarization assay
Bioorg Med Chem Lett 24: 3268-73 (2014)
Article DOI: 10.1016/j.bmcl.2014.06.010
BindingDB Entry DOI: 10.7270/Q21N82SN
Glucocorticoid receptor
(Homo sapiens (Human))
BDBM50048329
(CHEMBL3315051 | US9593113, Example 8)
Show SMILES CC(=O)NC(=O)C(C)(C)[C@@H]1c2ccc(nc2Oc2c(F)cccc12)-c1ccc(cc1)C(=O)N1CCCC1 |r|
Show InChI InChI=1S/C29H28FN3O4/c1-17(34)31-28(36)29(2,3)24-20-7-6-8-22(30)25(20)37-26-21(24)13-14-23(32-26)18-9-11-19(12-10-18)27(35)33-15-4-5-16-33/h6-14,24H,4-5,15-16H2,1-3H3,(H,31,34,36)/t24-/m0/s1
US Patent
3.59n/an/an/an/an/an/an/an/a
Bristol-Myers Squibb Company
US Patent
Assay Description
Binding Assay (I):In order to assess the affinity of test compounds for the human glucocorticoid receptor, a commercially available kit was used (Glu...
US Patent US9593113 (2017)
BindingDB Entry DOI: 10.7270/Q2833V3Z
Progesterone receptor
(Homo sapiens (Human))
BDBM50048329
(CHEMBL3315051 | US9593113, Example 8)
Show SMILES CC(=O)NC(=O)C(C)(C)[C@@H]1c2ccc(nc2Oc2c(F)cccc12)-c1ccc(cc1)C(=O)N1CCCC1 |r|
Show InChI InChI=1S/C29H28FN3O4/c1-17(34)31-28(36)29(2,3)24-20-7-6-8-22(30)25(20)37-26-21(24)13-14-23(32-26)18-9-11-19(12-10-18)27(35)33-15-4-5-16-33/h6-14,24H,4-5,15-16H2,1-3H3,(H,31,34,36)/t24-/m0/s1
1.24E+4n/an/an/an/an/an/an/an/a
Bristol-Myers Squibb Company
Curated by ChEMBL
Assay Description
Binding affinity to progesterone receptor (unknown origin) by fluorescence polarization assay
Bioorg Med Chem Lett 24: 3268-73 (2014)
Article DOI: 10.1016/j.bmcl.2014.06.010
BindingDB Entry DOI: 10.7270/Q21N82SN
Glucocorticoid receptor
(Homo sapiens (Human))
BDBM50048329
(CHEMBL3315051 | US9593113, Example 8)
Show SMILES CC(=O)NC(=O)C(C)(C)[C@@H]1c2ccc(nc2Oc2c(F)cccc12)-c1ccc(cc1)C(=O)N1CCCC1 |r|
Show InChI InChI=1S/C29H28FN3O4/c1-17(34)31-28(36)29(2,3)24-20-7-6-8-22(30)25(20)37-26-21(24)13-14-23(32-26)18-9-11-19(12-10-18)27(35)33-15-4-5-16-33/h6-14,24H,4-5,15-16H2,1-3H3,(H,31,34,36)/t24-/m0/s1
n/an/an/an/a 218n/an/an/an/a
Bristol-Myers Squibb Company
Curated by ChEMBL
Assay Description
Agonist activity at glucocorticoid receptor in human whole blood assessed as inhibition of LPS-induced TNF production incubated for 20 hrs prior to L...
Bioorg Med Chem Lett 24: 3268-73 (2014)
Article DOI: 10.1016/j.bmcl.2014.06.010
BindingDB Entry DOI: 10.7270/Q21N82SN
Glucocorticoid receptor
(Homo sapiens (Human))
BDBM50048329
(CHEMBL3315051 | US9593113, Example 8)
Show SMILES CC(=O)NC(=O)C(C)(C)[C@@H]1c2ccc(nc2Oc2c(F)cccc12)-c1ccc(cc1)C(=O)N1CCCC1 |r|
Show InChI InChI=1S/C29H28FN3O4/c1-17(34)31-28(36)29(2,3)24-20-7-6-8-22(30)25(20)37-26-21(24)13-14-23(32-26)18-9-11-19(12-10-18)27(35)33-15-4-5-16-33/h6-14,24H,4-5,15-16H2,1-3H3,(H,31,34,36)/t24-/m0/s1
n/an/an/an/a 3.60n/an/an/an/a
Bristol-Myers Squibb Company
Curated by ChEMBL
Assay Description
Agonist activity at glucocorticoid receptor in human A549 cells assessed as E-selectin transrepression by luciferase reporter gene assay
Bioorg Med Chem Lett 24: 3268-73 (2014)
Article DOI: 10.1016/j.bmcl.2014.06.010
BindingDB Entry DOI: 10.7270/Q21N82SN
Glucocorticoid receptor
(Homo sapiens (Human))
BDBM50048329
(CHEMBL3315051 | US9593113, Example 8)
Show SMILES CC(=O)NC(=O)C(C)(C)[C@@H]1c2ccc(nc2Oc2c(F)cccc12)-c1ccc(cc1)C(=O)N1CCCC1 |r|
Show InChI InChI=1S/C29H28FN3O4/c1-17(34)31-28(36)29(2,3)24-20-7-6-8-22(30)25(20)37-26-21(24)13-14-23(32-26)18-9-11-19(12-10-18)27(35)33-15-4-5-16-33/h6-14,24H,4-5,15-16H2,1-3H3,(H,31,34,36)/t24-/m0/s1
n/an/an/an/a 5.10n/an/an/an/a
Bristol-Myers Squibb Company
Curated by ChEMBL
Assay Description
Agonist activity at glucocorticoid receptor in human A549 cells assessed as AP-1 transrepression by luciferase reporter gene assay
Bioorg Med Chem Lett 24: 3268-73 (2014)
Article DOI: 10.1016/j.bmcl.2014.06.010
BindingDB Entry DOI: 10.7270/Q21N82SN
Glucocorticoid receptor
(Homo sapiens (Human))
BDBM50048329
(CHEMBL3315051 | US9593113, Example 8)
Show SMILES CC(=O)NC(=O)C(C)(C)[C@@H]1c2ccc(nc2Oc2c(F)cccc12)-c1ccc(cc1)C(=O)N1CCCC1 |r|
Show InChI InChI=1S/C29H28FN3O4/c1-17(34)31-28(36)29(2,3)24-20-7-6-8-22(30)25(20)37-26-21(24)13-14-23(32-26)18-9-11-19(12-10-18)27(35)33-15-4-5-16-33/h6-14,24H,4-5,15-16H2,1-3H3,(H,31,34,36)/t24-/m0/s1
n/an/an/an/a 27n/an/an/an/a
Bristol-Myers Squibb Company
Curated by ChEMBL
Assay Description
Agonist activity at glucocorticoid receptor in human HeLa cells assessed as NP-1 transactivation by luciferase reporter gene assay
Bioorg Med Chem Lett 24: 3268-73 (2014)
Article DOI: 10.1016/j.bmcl.2014.06.010
BindingDB Entry DOI: 10.7270/Q21N82SN