BDBM50048344 CHEMBL3315066
SMILES: CC(C)([C@@H]1c2ccc(nc2Oc2c(F)cccc12)-c1ccc(cc1)C(=O)N1CC[C@H](F)C1)C(=O)NC(N)=O
InChI Key: InChIKey=IUOHWOUDFIBXAH-JTSKRJEESA-N
Data: 2 KI  3 EC50
Activity Spreadsheet -- Enzyme Inhibition Constant Data from BindingDB
Found 5 hits for monomerid = 50048344
Trg + Lig
Ki
nM
ΔG°
kcal/mole
IC50
nM
Kd
nM
EC50/IC50
nM
koff
s-1
kon
M-1s-1
pHTemp
°C
Glucocorticoid receptor
(Homo sapiens (Human))
BDBM50048344
(CHEMBL3315066)
Show SMILES CC(C)([C@@H]1c2ccc(nc2Oc2c(F)cccc12)-c1ccc(cc1)C(=O)N1CC[C@H](F)C1)C(=O)NC(N)=O |r|
Show InChI InChI=1S/C28H26F2N4O4/c1-28(2,26(36)33-27(31)37)22-18-4-3-5-20(30)23(18)38-24-19(22)10-11-21(32-24)15-6-8-16(9-7-15)25(35)34-13-12-17(29)14-34/h3-11,17,22H,12-14H2,1-2H3,(H3,31,33,36,37)/t17-,22-/m0/s1
1.20n/an/an/an/an/an/an/an/a
Bristol-Myers Squibb Company
Curated by ChEMBL
Assay Description
Binding affinity to glucocorticoid receptor (unknown origin) by fluorescence polarization assay
Bioorg Med Chem Lett 24: 3268-73 (2014)
Article DOI: 10.1016/j.bmcl.2014.06.010
BindingDB Entry DOI: 10.7270/Q21N82SN
Progesterone receptor
(Homo sapiens (Human))
BDBM50048344
(CHEMBL3315066)
Show SMILES CC(C)([C@@H]1c2ccc(nc2Oc2c(F)cccc12)-c1ccc(cc1)C(=O)N1CC[C@H](F)C1)C(=O)NC(N)=O |r|
Show InChI InChI=1S/C28H26F2N4O4/c1-28(2,26(36)33-27(31)37)22-18-4-3-5-20(30)23(18)38-24-19(22)10-11-21(32-24)15-6-8-16(9-7-15)25(35)34-13-12-17(29)14-34/h3-11,17,22H,12-14H2,1-2H3,(H3,31,33,36,37)/t17-,22-/m0/s1
3.33E+4n/an/an/an/an/an/an/an/a
Bristol-Myers Squibb Company
Curated by ChEMBL
Assay Description
Binding affinity to progesterone receptor (unknown origin) by fluorescence polarization assay
Bioorg Med Chem Lett 24: 3268-73 (2014)
Article DOI: 10.1016/j.bmcl.2014.06.010
BindingDB Entry DOI: 10.7270/Q21N82SN
Glucocorticoid receptor
(Homo sapiens (Human))
BDBM50048344
(CHEMBL3315066)
Show SMILES CC(C)([C@@H]1c2ccc(nc2Oc2c(F)cccc12)-c1ccc(cc1)C(=O)N1CC[C@H](F)C1)C(=O)NC(N)=O |r|
Show InChI InChI=1S/C28H26F2N4O4/c1-28(2,26(36)33-27(31)37)22-18-4-3-5-20(30)23(18)38-24-19(22)10-11-21(32-24)15-6-8-16(9-7-15)25(35)34-13-12-17(29)14-34/h3-11,17,22H,12-14H2,1-2H3,(H3,31,33,36,37)/t17-,22-/m0/s1
n/an/an/an/a 1.30n/an/an/an/a
Bristol-Myers Squibb Company
Curated by ChEMBL
Assay Description
Agonist activity at glucocorticoid receptor in human HeLa cells assessed as NP-1 transactivation by luciferase reporter gene assay
Bioorg Med Chem Lett 24: 3268-73 (2014)
Article DOI: 10.1016/j.bmcl.2014.06.010
BindingDB Entry DOI: 10.7270/Q21N82SN
Glucocorticoid receptor
(Homo sapiens (Human))
BDBM50048344
(CHEMBL3315066)
Show SMILES CC(C)([C@@H]1c2ccc(nc2Oc2c(F)cccc12)-c1ccc(cc1)C(=O)N1CC[C@H](F)C1)C(=O)NC(N)=O |r|
Show InChI InChI=1S/C28H26F2N4O4/c1-28(2,26(36)33-27(31)37)22-18-4-3-5-20(30)23(18)38-24-19(22)10-11-21(32-24)15-6-8-16(9-7-15)25(35)34-13-12-17(29)14-34/h3-11,17,22H,12-14H2,1-2H3,(H3,31,33,36,37)/t17-,22-/m0/s1
n/an/an/an/a 0.800n/an/an/an/a
Bristol-Myers Squibb Company
Curated by ChEMBL
Assay Description
Agonist activity at glucocorticoid receptor in human A549 cells assessed as AP-1 transrepression by luciferase reporter gene assay
Bioorg Med Chem Lett 24: 3268-73 (2014)
Article DOI: 10.1016/j.bmcl.2014.06.010
BindingDB Entry DOI: 10.7270/Q21N82SN
Glucocorticoid receptor
(Homo sapiens (Human))
BDBM50048344
(CHEMBL3315066)
Show SMILES CC(C)([C@@H]1c2ccc(nc2Oc2c(F)cccc12)-c1ccc(cc1)C(=O)N1CC[C@H](F)C1)C(=O)NC(N)=O |r|
Show InChI InChI=1S/C28H26F2N4O4/c1-28(2,26(36)33-27(31)37)22-18-4-3-5-20(30)23(18)38-24-19(22)10-11-21(32-24)15-6-8-16(9-7-15)25(35)34-13-12-17(29)14-34/h3-11,17,22H,12-14H2,1-2H3,(H3,31,33,36,37)/t17-,22-/m0/s1
n/an/an/an/a 0.600n/an/an/an/a
Bristol-Myers Squibb Company
Curated by ChEMBL
Assay Description
Agonist activity at glucocorticoid receptor in human A549 cells assessed as E-selectin transrepression by luciferase reporter gene assay
Bioorg Med Chem Lett 24: 3268-73 (2014)
Article DOI: 10.1016/j.bmcl.2014.06.010
BindingDB Entry DOI: 10.7270/Q21N82SN