BDBM50048399 (S)-2-[((S)-2-{(S)-2-[2-(3H-Imidazol-4-yl)-ethylamino]-3-methyl-butyryl}-1,2,3,4-tetrahydro-isoquinoline-3-carbonyl)-amino]-4-methylsulfanyl-butyric acid::(S)-2-[(2-{(S)-2-[2-(3H-Imidazol-4-yl)-ethylamino]-3-methyl-butyryl}-1,2,3,4-tetrahydro-isoquinoline-3-carbonyl)-amino]-4-methylsulfanyl-butyric acid::CHEMBL90471
SMILES: CSCC[C@H](NC(=O)[C@@H]1Cc2ccccc2CN1C(=O)[C@@H](NCCc1cnc[nH]1)C(C)C)C(O)=O
InChI Key: InChIKey=RDECPKAPXFKZRQ-FKBYEOEOSA-N
Data: 4 IC50
Activity Spreadsheet -- Enzyme Inhibition Constant Data from BindingDB
Found 4 hits for monomerid = 50048399
Trg + Lig
Ki
nM
ΔG°
kcal/mole
IC50
nM
Kd
nM
EC50/IC50
nM
koff
s-1
kon
M-1s-1
pHTemp
°C
Protein Farnesyltransferase (PFT) Chain B
(Homo sapiens (Human))
BDBM50048399
((S)-2-[((S)-2-{(S)-2-[2-(3H-Imidazol-4-yl)-ethylam...)
Show SMILES CSCC[C@H](NC(=O)[C@@H]1Cc2ccccc2CN1C(=O)[C@@H](NCCc1cnc[nH]1)C(C)C)C(O)=O
Show InChI InChI=1S/C25H35N5O4S/c1-16(2)22(27-10-8-19-13-26-15-28-19)24(32)30-14-18-7-5-4-6-17(18)12-21(30)23(31)29-20(25(33)34)9-11-35-3/h4-7,13,15-16,20-22,27H,8-12,14H2,1-3H3,(H,26,28)(H,29,31)(H,33,34)/t20-,21-,22-/m0/s1
n/an/a 0.790n/an/an/an/an/an/a
Bristol-Myers Squibb Pharmaceutical Research Institute
Curated by ChEMBL
Assay Description
Inhibition of Farnesyltransferase
J Med Chem 39: 353-8 (1996)
Article DOI: 10.1021/jm9507284
BindingDB Entry DOI: 10.7270/Q2QZ2925
Protein Farnesyltransferase (PFT)/farnesyltransferase beta subunit
(Rattus norvegicus-Rattus norvegicus (rat))
BDBM50048399
((S)-2-[((S)-2-{(S)-2-[2-(3H-Imidazol-4-yl)-ethylam...)
Show SMILES CSCC[C@H](NC(=O)[C@@H]1Cc2ccccc2CN1C(=O)[C@@H](NCCc1cnc[nH]1)C(C)C)C(O)=O
Show InChI InChI=1S/C25H35N5O4S/c1-16(2)22(27-10-8-19-13-26-15-28-19)24(32)30-14-18-7-5-4-6-17(18)12-21(30)23(31)29-20(25(33)34)9-11-35-3/h4-7,13,15-16,20-22,27H,8-12,14H2,1-3H3,(H,26,28)(H,29,31)(H,33,34)/t20-,21-,22-/m0/s1
n/an/a 0.790n/an/an/an/an/an/a
Warner-Lambert Company
Curated by ChEMBL
Assay Description
Activity against rat Farnesyltransferase
J Med Chem 40: 2971-90 (1997)
Article DOI: 10.1021/jm970226l
BindingDB Entry DOI: 10.7270/Q26M37HF
Protein Farnesyltransferase (PFT)
(Homo sapiens (Human))
BDBM50048399
((S)-2-[((S)-2-{(S)-2-[2-(3H-Imidazol-4-yl)-ethylam...)
Show SMILES CSCC[C@H](NC(=O)[C@@H]1Cc2ccccc2CN1C(=O)[C@@H](NCCc1cnc[nH]1)C(C)C)C(O)=O
Show InChI InChI=1S/C25H35N5O4S/c1-16(2)22(27-10-8-19-13-26-15-28-19)24(32)30-14-18-7-5-4-6-17(18)12-21(30)23(31)29-20(25(33)34)9-11-35-3/h4-7,13,15-16,20-22,27H,8-12,14H2,1-3H3,(H,26,28)(H,29,31)(H,33,34)/t20-,21-,22-/m0/s1
Reactome pathway
n/an/a 0.800n/an/an/an/an/an/a
Bristol-Myers Squibb Pharmaceutical Research Institute
Curated by ChEMBL
Assay Description
Inhibition of Farnesyltransferase
Bioorg Med Chem Lett 10: 273-5 (2000)
BindingDB Entry DOI: 10.7270/Q26W999M
Geranylgeranyl transferase type I beta subunit/Protein Farnesyltransferase (PFT)
(Homo sapiens (Human))
BDBM50048399
((S)-2-[((S)-2-{(S)-2-[2-(3H-Imidazol-4-yl)-ethylam...)
Show SMILES CSCC[C@H](NC(=O)[C@@H]1Cc2ccccc2CN1C(=O)[C@@H](NCCc1cnc[nH]1)C(C)C)C(O)=O
Show InChI InChI=1S/C25H35N5O4S/c1-16(2)22(27-10-8-19-13-26-15-28-19)24(32)30-14-18-7-5-4-6-17(18)12-21(30)23(31)29-20(25(33)34)9-11-35-3/h4-7,13,15-16,20-22,27H,8-12,14H2,1-3H3,(H,26,28)(H,29,31)(H,33,34)/t20-,21-,22-/m0/s1
n/an/a 234n/an/an/an/an/an/a
Bristol-Myers Squibb Pharmaceutical Research Institute
Curated by ChEMBL
Assay Description
Inhibition of Geranylgeranyl transferase type I
J Med Chem 39: 353-8 (1996)
Article DOI: 10.1021/jm9507284
BindingDB Entry DOI: 10.7270/Q2QZ2925