BDBM50048421 CHEMBL3315083
SMILES: COc1ccc(C(=O)Cc2c(Cl)cncc2Cl)c(OCC(=O)NCc2ccccc2)c1OC
InChI Key: InChIKey=QAWMQQLOQHCIJW-UHFFFAOYSA-N
Data: 1 IC50
PDB links: 1 PDB ID matches this monomer.
Activity Spreadsheet -- Enzyme Inhibition Constant Data from BindingDB
Found 1 hit for monomerid = 50048421
Trg + Lig
Ki
nM
ΔG°
kcal/mole
IC50
nM
Kd
nM
EC50/IC50
nM
koff
s-1
kon
M-1s-1
pHTemp
°C
cAMP-specific 3',5'-cyclic phosphodiesterase 4D
(Homo sapiens (Human))
BDBM50048421
(CHEMBL3315083)
Show SMILES COc1ccc(C(=O)Cc2c(Cl)cncc2Cl)c(OCC(=O)NCc2ccccc2)c1OC
Show InChI InChI=1S/C24H22Cl2N2O5/c1-31-21-9-8-16(20(29)10-17-18(25)12-27-13-19(17)26)23(24(21)32-2)33-14-22(30)28-11-15-6-4-3-5-7-15/h3-9,12-13H,10-11,14H2,1-2H3,(H,28,30)
n/an/a 3n/an/an/an/an/an/a
LEO Pharma A/S
Curated by ChEMBL
Assay Description
Inhibition of human recombinant PDE4D after 1 hr by SPA in presence of radioactively labeled cAMP
J Med Chem 57: 5893-903 (2014)
Article DOI: 10.1021/jm500378a
BindingDB Entry DOI: 10.7270/Q2CV4KC4
3D
3D Structure (crystal)