BDBM50048484 CHEMBL3310166
SMILES: CCOc1ccc(Cc2nc3cc(ccc3n2CCC(C)C)C(=O)NCCCCCCCCCCN(C)CCCCCCCCCCNC(=O)c2ccc3n(CCC(C)C)c(Cc4ccc(OCC)cc4)nc3c2)cc1
InChI Key: InChIKey=PGYGYIVEQQZKCJ-UHFFFAOYSA-N
Data: 2 EC50
Activity Spreadsheet -- Enzyme Inhibition Constant Data from BindingDB
Found 2 hits for monomerid = 50048484
Trg + Lig
Ki
nM
ΔG°
kcal/mole
IC50
nM
Kd
nM
EC50/IC50
nM
koff
s-1
kon
M-1s-1
pHTemp
°C
Cannabinoid receptor 1
(Homo sapiens (Human))
BDBM50048484
(CHEMBL3310166)
Show SMILES CCOc1ccc(Cc2nc3cc(ccc3n2CCC(C)C)C(=O)NCCCCCCCCCCN(C)CCCCCCCCCCNC(=O)c2ccc3n(CCC(C)C)c(Cc4ccc(OCC)cc4)nc3c2)cc1
Show InChI InChI=1S/C65H95N7O4/c1-8-75-56-32-26-52(27-33-56)46-62-68-58-48-54(30-36-60(58)71(62)44-38-50(3)4)64(73)66-40-22-18-14-10-12-16-20-24-42-70(7)43-25-21-17-13-11-15-19-23-41-67-65(74)55-31-37-61-59(49-55)69-63(72(61)45-39-51(5)6)47-53-28-34-57(35-29-53)76-9-2/h26-37,48-51H,8-25,38-47H2,1-7H3,(H,66,73)(H,67,74)
NCI pathway
Reactome pathway
n/an/an/an/a 2.57E+4n/an/an/an/a
Julius-Maximilians-Universit£t W£rzburg
Curated by ChEMBL
Assay Description
Inverse agonist activity at human CB1 receptor expressed in Sf9 cells coexpressing Galpha i2 assessed as Galpha GTPase activity using [gamma-33P]GTP ...
Bioorg Med Chem 22: 3938-46 (2014)
Article DOI: 10.1016/j.bmc.2014.06.008
BindingDB Entry DOI: 10.7270/Q2862J3W
Cannabinoid receptor 2
(Homo sapiens (Human))
BDBM50048484
(CHEMBL3310166)
Show SMILES CCOc1ccc(Cc2nc3cc(ccc3n2CCC(C)C)C(=O)NCCCCCCCCCCN(C)CCCCCCCCCCNC(=O)c2ccc3n(CCC(C)C)c(Cc4ccc(OCC)cc4)nc3c2)cc1
Show InChI InChI=1S/C65H95N7O4/c1-8-75-56-32-26-52(27-33-56)46-62-68-58-48-54(30-36-60(58)71(62)44-38-50(3)4)64(73)66-40-22-18-14-10-12-16-20-24-42-70(7)43-25-21-17-13-11-15-19-23-41-67-65(74)55-31-37-61-59(49-55)69-63(72(61)45-39-51(5)6)47-53-28-34-57(35-29-53)76-9-2/h26-37,48-51H,8-25,38-47H2,1-7H3,(H,66,73)(H,67,74)
Reactome pathway
n/an/an/an/a 1.66E+4n/an/an/an/a
Julius-Maximilians-Universit£t W£rzburg
Curated by ChEMBL
Assay Description
Inverse agonist activity at human CB2 receptor expressed in Sf9 cells coexpressing Galpha i2 assessed as Galpha GTPase activity using [gamma-33P]GTP ...
Bioorg Med Chem 22: 3938-46 (2014)
Article DOI: 10.1016/j.bmc.2014.06.008
BindingDB Entry DOI: 10.7270/Q2862J3W