BDBM50048621 CHEMBL3319619
SMILES: CC1(C)CCc2cc(ccc2O1)S(=O)(=O)N(CC(O)=O)Cc1cccc(Oc2ccccc2)c1
InChI Key: InChIKey=FVEHYQSBYVXTOO-UHFFFAOYSA-N
Data: 1 KI  2 IC50
Activity Spreadsheet -- Enzyme Inhibition Constant Data from BindingDB
Found 3 hits for monomerid = 50048621
Trg + Lig
Ki
nM
ΔG°
kcal/mole
IC50
nM
Kd
nM
EC50/IC50
nM
koff
s-1
kon
M-1s-1
pHTemp
°C
Monoacylglycerol lipase ABHD6
(Homo sapiens (Human))
BDBM50048621
(CHEMBL3319619)
Show SMILES CC1(C)CCc2cc(ccc2O1)S(=O)(=O)N(CC(O)=O)Cc1cccc(Oc2ccccc2)c1
Show InChI InChI=1S/C26H27NO6S/c1-26(2)14-13-20-16-23(11-12-24(20)33-26)34(30,31)27(18-25(28)29)17-19-7-6-10-22(15-19)32-21-8-4-3-5-9-21/h3-12,15-16H,13-14,17-18H2,1-2H3,(H,28,29)
1.83E+4n/an/an/an/an/an/an/an/a
Leiden University
Curated by ChEMBL
Assay Description
Inhibition of human ABHD6 expressed in HEK293T cell membranes assessed as reduction in glycerol production using 2-arachidonoyl glycerol substrate
J Med Chem 57: 6610-22 (2014)
Article DOI: 10.1021/jm500681z
BindingDB Entry DOI: 10.7270/Q2R49SD4
Sn1-specific diacylglycerol lipase alpha
(Homo sapiens (Human))
BDBM50048621
(CHEMBL3319619)
Show SMILES CC1(C)CCc2cc(ccc2O1)S(=O)(=O)N(CC(O)=O)Cc1cccc(Oc2ccccc2)c1
Show InChI InChI=1S/C26H27NO6S/c1-26(2)14-13-20-16-23(11-12-24(20)33-26)34(30,31)27(18-25(28)29)17-19-7-6-10-22(15-19)32-21-8-4-3-5-9-21/h3-12,15-16H,13-14,17-18H2,1-2H3,(H,28,29)
NCI pathway
Reactome pathway
n/an/a 56n/an/an/an/an/an/a
Leiden University
Curated by ChEMBL
Assay Description
Inhibition of human DAGLalpha expressed in HEK293T cell membranes
J Med Chem 57: 6610-22 (2014)
Article DOI: 10.1021/jm500681z
BindingDB Entry DOI: 10.7270/Q2R49SD4
Sn1-specific diacylglycerol lipase alpha
(Mus musculus)
BDBM50048621
(CHEMBL3319619)
Show SMILES CC1(C)CCc2cc(ccc2O1)S(=O)(=O)N(CC(O)=O)Cc1cccc(Oc2ccccc2)c1
Show InChI InChI=1S/C26H27NO6S/c1-26(2)14-13-20-16-23(11-12-24(20)33-26)34(30,31)27(18-25(28)29)17-19-7-6-10-22(15-19)32-21-8-4-3-5-9-21/h3-12,15-16H,13-14,17-18H2,1-2H3,(H,28,29)
n/an/a 355n/an/an/an/an/an/a
Leiden University
Curated by ChEMBL
Assay Description
Inhibition of MB064 labeling of DAGLalpha in mouse brain homogenates by activity based protein profiling assay
J Med Chem 57: 6610-22 (2014)
Article DOI: 10.1021/jm500681z
BindingDB Entry DOI: 10.7270/Q2R49SD4