BDBM50048698 CHEMBL3315145
SMILES: CC(C)[C@H](NC(=O)[C@@H]1CSSC(C)(C)[C@H](NC(=O)[C@@H](N)CC(O)=O)C(=O)N[C@@H](Cc2ccccc2)C(=O)N[C@H](Cc2c[nH]c3ccccc23)C(=O)N[C@@H](CCCN)C(=O)N[C@@H](Cc2nc3ccccc3s2)C(=O)N1)C(O)=O
InChI Key:
Data: 1 KI  1 EC50
Activity Spreadsheet -- Enzyme Inhibition Constant Data from BindingDB
Found 2 hits for monomerid = 50048698
Trg + Lig
Ki
nM
ΔG°
kcal/mole
IC50
nM
Kd
nM
EC50/IC50
nM
koff
s-1
kon
M-1s-1
pHTemp
°C
Urotensin II receptor
(Homo sapiens (Human))
BDBM50048698
(CHEMBL3315145)
Show SMILES CC(C)[C@H](NC(=O)[C@@H]1CSSC(C)(C)[C@H](NC(=O)[C@@H](N)CC(O)=O)C(=O)N[C@@H](Cc2ccccc2)C(=O)N[C@H](Cc2c[nH]c3ccccc23)C(=O)N[C@@H](CCCN)C(=O)N[C@@H](Cc2nc3ccccc3s2)C(=O)N1)C(O)=O |r|
Reactome pathway
13n/an/an/an/an/an/an/an/a
University of Naples"Federico II"
Curated by ChEMBL
Assay Description
Displacement of [125I]urotensin-2 from human recombinant UT receptor expressed in CHO-K1 cells by scintillation counting method
J Med Chem 57: 5965-74 (2014)
Article DOI: 10.1021/jm500218x
BindingDB Entry DOI: 10.7270/Q2MC91NB
UTS2R
(RAT)
BDBM50048698
(CHEMBL3315145)
Show SMILES CC(C)[C@H](NC(=O)[C@@H]1CSSC(C)(C)[C@H](NC(=O)[C@@H](N)CC(O)=O)C(=O)N[C@@H](Cc2ccccc2)C(=O)N[C@H](Cc2c[nH]c3ccccc23)C(=O)N[C@@H](CCCN)C(=O)N[C@@H](Cc2nc3ccccc3s2)C(=O)N1)C(O)=O |r|
Reactome pathway
n/an/an/an/a 34n/an/an/an/a
University of Naples"Federico II"
Curated by ChEMBL
Assay Description
Agonist activity at UT receptor in rat aorta assessed as contraction
J Med Chem 57: 5965-74 (2014)
Article DOI: 10.1021/jm500218x
BindingDB Entry DOI: 10.7270/Q2MC91NB