BDBM50048844 CHEMBL3310332
SMILES: Cc1cc(O)cc(c1)-c1nn(C)cc1-c1cc(nc(n1)-c1cccnc1)N1CCOCC1
InChI Key: InChIKey=JRQZVGYJEGMKQR-UHFFFAOYSA-N
Data: 1 IC50
Activity Spreadsheet -- Enzyme Inhibition Constant Data from BindingDB
Found 1 hit for monomerid = 50048844
Trg + Lig
Ki
nM
ΔG°
kcal/mole
IC50
nM
Kd
nM
EC50/IC50
nM
koff
s-1
kon
M-1s-1
pHTemp
°C
Proto-oncogene tyrosine-protein kinase ROS
(Homo sapiens (Human))
BDBM50048844
(CHEMBL3310332)
Show SMILES Cc1cc(O)cc(c1)-c1nn(C)cc1-c1cc(nc(n1)-c1cccnc1)N1CCOCC1
Show InChI InChI=1S/C24H24N6O2/c1-16-10-18(12-19(31)11-16)23-20(15-29(2)28-23)21-13-22(30-6-8-32-9-7-30)27-24(26-21)17-4-3-5-25-14-17/h3-5,10-15,31H,6-9H2,1-2H3
n/an/a 14n/an/an/an/an/an/a
Yonsei University
Curated by ChEMBL
Assay Description
Inhibition of ROS1 (unknown origin) assessed as remaining activity
Bioorg Med Chem 22: 3871-8 (2014)
Article DOI: 10.1016/j.bmc.2014.06.020
BindingDB Entry DOI: 10.7270/Q2765H0Z