BDBM50049026 5-(4-Fluoro-phenyl)-6-(4-methanesulfonyl-phenyl)-spiro[2.4]hepta-4,6-diene::CHEMBL89429
SMILES: CS(=O)(=O)c1ccc(cc1)C1=CC2(CC2)C=C1c1ccc(F)cc1
InChI Key: InChIKey=CJAWPKAYKMKKAD-UHFFFAOYSA-N
Data: 4 IC50
Activity Spreadsheet -- Enzyme Inhibition Constant Data from BindingDB
Found 4 hits for monomerid = 50049026
Trg + Lig
Ki
nM
ΔG°
kcal/mole
IC50
nM
Kd
nM
EC50/IC50
nM
koff
s-1
kon
M-1s-1
pHTemp
°C
Cyclooxygenase-1 (COX-1)
(Homo sapiens (Human))
BDBM50049026
(5-(4-Fluoro-phenyl)-6-(4-methanesulfonyl-phenyl)-s...)
Show SMILES CS(=O)(=O)c1ccc(cc1)C1=CC2(CC2)C=C1c1ccc(F)cc1 |c:17,t:11|
Show InChI InChI=1S/C20H17FO2S/c1-24(22,23)17-8-4-15(5-9-17)19-13-20(10-11-20)12-18(19)14-2-6-16(21)7-3-14/h2-9,12-13H,10-11H2,1H3
n/an/a 1.32E+3n/an/an/an/an/an/a
Searle Research and Development
Curated by ChEMBL
Assay Description
Inhibitory activity against prostaglandin G/H synthase 1 (COX-1).
J Med Chem 39: 253-66 (1996)
Article DOI: 10.1021/jm950664x
BindingDB Entry DOI: 10.7270/Q2XG9Q6M
Prostaglandin E synthase/G/H synthase 2
(Homo sapiens (Human))
BDBM50049026
(5-(4-Fluoro-phenyl)-6-(4-methanesulfonyl-phenyl)-s...)
Show SMILES CS(=O)(=O)c1ccc(cc1)C1=CC2(CC2)C=C1c1ccc(F)cc1 |c:17,t:11|
Show InChI InChI=1S/C20H17FO2S/c1-24(22,23)17-8-4-15(5-9-17)19-13-20(10-11-20)12-18(19)14-2-6-16(21)7-3-14/h2-9,12-13H,10-11H2,1H3
NCI pathway
Reactome pathway
n/an/a 26n/an/an/an/an/an/a
The M.S University of Baroda
Curated by ChEMBL
Assay Description
Inhibition of recombinant human COX-2 expressed in Baculovirus infected sf9 cells using arachidonic acid as substrate preincubated for 10 mins follow...
Eur J Med Chem 162: 1-17 (2019)
Article DOI: 10.1016/j.ejmech.2018.10.054
Cyclooxygenase
(Homo sapiens (Human))
BDBM50049026
(5-(4-Fluoro-phenyl)-6-(4-methanesulfonyl-phenyl)-s...)
Show SMILES CS(=O)(=O)c1ccc(cc1)C1=CC2(CC2)C=C1c1ccc(F)cc1 |c:17,t:11|
Show InChI InChI=1S/C20H17FO2S/c1-24(22,23)17-8-4-15(5-9-17)19-13-20(10-11-20)12-18(19)14-2-6-16(21)7-3-14/h2-9,12-13H,10-11H2,1H3
NCI pathway
Reactome pathway
n/an/a 25.7n/an/an/an/an/an/a
Universit£ de Lille 2
Curated by ChEMBL
Assay Description
Inhibition of human Prostaglandin G/H synthase 2
J Med Chem 44: 3223-30 (2001)
BindingDB Entry DOI: 10.7270/Q2736S4D
Cyclooxygenase
(Homo sapiens (Human))
BDBM50049026
(5-(4-Fluoro-phenyl)-6-(4-methanesulfonyl-phenyl)-s...)
Show SMILES CS(=O)(=O)c1ccc(cc1)C1=CC2(CC2)C=C1c1ccc(F)cc1 |c:17,t:11|
Show InChI InChI=1S/C20H17FO2S/c1-24(22,23)17-8-4-15(5-9-17)19-13-20(10-11-20)12-18(19)14-2-6-16(21)7-3-14/h2-9,12-13H,10-11H2,1H3
NCI pathway
Reactome pathway
n/an/a 2.60n/an/an/an/an/an/a
Searle Research and Development
Curated by ChEMBL
Assay Description
Inhibitory activity of the compound against prostaglandin G/H synthase 2 (COX-2).
J Med Chem 39: 253-66 (1996)
Article DOI: 10.1021/jm950664x
BindingDB Entry DOI: 10.7270/Q2XG9Q6M