BDBM50049028 5-[6-(4-Methanesulfonyl-phenyl)-spiro[2.4]hept-5-en-5-yl]-benzo[1,3]dioxole::CHEMBL88549
SMILES: CS(=O)(=O)c1ccc(cc1)C1=C(CC2(CC2)C1)c1ccc2OCOc2c1
InChI Key: InChIKey=MUBCEZUXQKGARZ-UHFFFAOYSA-N
Data: 3 IC50
Activity Spreadsheet -- Enzyme Inhibition Constant Data from BindingDB
Found 3 hits for monomerid = 50049028
Trg + Lig
Ki
nM
ΔG°
kcal/mole
IC50
nM
Kd
nM
EC50/IC50
nM
koff
s-1
kon
M-1s-1
pHTemp
°C
Cyclooxygenase-1 (COX-1)
(Homo sapiens (Human))
BDBM50049028
(5-[6-(4-Methanesulfonyl-phenyl)-spiro[2.4]hept-5-e...)
Show SMILES CS(=O)(=O)c1ccc(cc1)C1=C(CC2(CC2)C1)c1ccc2OCOc2c1 |t:11|
Show InChI InChI=1S/C21H20O4S/c1-26(22,23)16-5-2-14(3-6-16)17-11-21(8-9-21)12-18(17)15-4-7-19-20(10-15)25-13-24-19/h2-7,10H,8-9,11-13H2,1H3
n/an/a 1.40E+3n/an/an/an/an/an/a
Searle Research and Development
Curated by ChEMBL
Assay Description
Inhibitory activity against prostaglandin G/H synthase 1 (COX-1).
J Med Chem 39: 253-66 (1996)
Article DOI: 10.1021/jm950664x
BindingDB Entry DOI: 10.7270/Q2XG9Q6M
Cyclooxygenase
(Homo sapiens (Human))
BDBM50049028
(5-[6-(4-Methanesulfonyl-phenyl)-spiro[2.4]hept-5-e...)
Show SMILES CS(=O)(=O)c1ccc(cc1)C1=C(CC2(CC2)C1)c1ccc2OCOc2c1 |t:11|
Show InChI InChI=1S/C21H20O4S/c1-26(22,23)16-5-2-14(3-6-16)17-11-21(8-9-21)12-18(17)15-4-7-19-20(10-15)25-13-24-19/h2-7,10H,8-9,11-13H2,1H3
NCI pathway
Reactome pathway
n/an/a 2.51n/an/an/an/an/an/a
Universit£ de Lille 2
Curated by ChEMBL
Assay Description
Inhibition of human Prostaglandin G/H synthase 2
J Med Chem 44: 3223-30 (2001)
BindingDB Entry DOI: 10.7270/Q2736S4D
Cyclooxygenase
(Homo sapiens (Human))
BDBM50049028
(5-[6-(4-Methanesulfonyl-phenyl)-spiro[2.4]hept-5-e...)
Show SMILES CS(=O)(=O)c1ccc(cc1)C1=C(CC2(CC2)C1)c1ccc2OCOc2c1 |t:11|
Show InChI InChI=1S/C21H20O4S/c1-26(22,23)16-5-2-14(3-6-16)17-11-21(8-9-21)12-18(17)15-4-7-19-20(10-15)25-13-24-19/h2-7,10H,8-9,11-13H2,1H3
NCI pathway
Reactome pathway
n/an/a 2.5n/an/an/an/an/an/a
Searle Research and Development
Curated by ChEMBL
Assay Description
Inhibitory activity of the compound against prostaglandin G/H synthase 2 (COX-2).
J Med Chem 39: 253-66 (1996)
Article DOI: 10.1021/jm950664x
BindingDB Entry DOI: 10.7270/Q2XG9Q6M