BDBM50049041 5-(4-Fluoro-phenyl)-6-(4-methanesulfonyl-phenyl)-spiro[2.4]hept-5-ene::CHEMBL92154::SC-58451
SMILES: CS(=O)(=O)c1ccc(cc1)C1=C(CC2(CC2)C1)c1ccc(F)cc1
InChI Key: InChIKey=VZCIAZMKVAJRCL-UHFFFAOYSA-N
Data: 8 IC50
Activity Spreadsheet -- Enzyme Inhibition Constant Data from BindingDB
Found 8 hits for monomerid = 50049041
Trg + Lig
Ki
nM
ΔG°
kcal/mole
IC50
nM
Kd
nM
EC50/IC50
nM
koff
s-1
kon
M-1s-1
pHTemp
°C
Cyclooxygenase-1 (COX-1)
(Homo sapiens (Human))
BDBM50049041
(5-(4-Fluoro-phenyl)-6-(4-methanesulfonyl-phenyl)-s...)
Show SMILES CS(=O)(=O)c1ccc(cc1)C1=C(CC2(CC2)C1)c1ccc(F)cc1 |t:11|
Show InChI InChI=1S/C20H19FO2S/c1-24(22,23)17-8-4-15(5-9-17)19-13-20(10-11-20)12-18(19)14-2-6-16(21)7-3-14/h2-9H,10-13H2,1H3
n/an/a 5.40E+3n/an/an/an/an/an/a
TBA
Curated by ChEMBL
Assay Description
Compound was evaluated in vitro for the inhibitory activity against constitutive form of human recombinant Prostaglandin G/H synthase 1
Bioorg Med Chem Lett 5: 867-872 (1995)
Article DOI: 10.1016/0960-894X(95)00131-C
BindingDB Entry DOI: 10.7270/Q2P26Z3Q
Cyclooxygenase-1 (COX-1)
(Homo sapiens (Human))
BDBM50049041
(5-(4-Fluoro-phenyl)-6-(4-methanesulfonyl-phenyl)-s...)
Show SMILES CS(=O)(=O)c1ccc(cc1)C1=C(CC2(CC2)C1)c1ccc(F)cc1 |t:11|
Show InChI InChI=1S/C20H19FO2S/c1-24(22,23)17-8-4-15(5-9-17)19-13-20(10-11-20)12-18(19)14-2-6-16(21)7-3-14/h2-9H,10-13H2,1H3
n/an/a 140n/an/an/an/an/an/a
TBA
Curated by ChEMBL
Assay Description
Inhibition of PGE-2 production in arachidonic acid-stimulated CHO cells expressing human Prostaglandin G/H synthase 1
Bioorg Med Chem Lett 6: 2677-2682 (1996)
Article DOI: 10.1016/S0960-894X(96)00501-X
BindingDB Entry DOI: 10.7270/Q2RB74M8
Cyclooxygenase-1 (COX-1)
(Homo sapiens (Human))
BDBM50049041
(5-(4-Fluoro-phenyl)-6-(4-methanesulfonyl-phenyl)-s...)
Show SMILES CS(=O)(=O)c1ccc(cc1)C1=C(CC2(CC2)C1)c1ccc(F)cc1 |t:11|
Show InChI InChI=1S/C20H19FO2S/c1-24(22,23)17-8-4-15(5-9-17)19-13-20(10-11-20)12-18(19)14-2-6-16(21)7-3-14/h2-9H,10-13H2,1H3
n/an/a 5.40E+3n/an/an/an/an/an/a
Searle Research and Development
Curated by ChEMBL
Assay Description
Inhibitory activity against prostaglandin G/H synthase 1 (COX-1).
J Med Chem 39: 253-66 (1996)
Article DOI: 10.1021/jm950664x
BindingDB Entry DOI: 10.7270/Q2XG9Q6M
Prostaglandin E synthase/G/H synthase 2
(Homo sapiens (Human))
BDBM50049041
(5-(4-Fluoro-phenyl)-6-(4-methanesulfonyl-phenyl)-s...)
Show SMILES CS(=O)(=O)c1ccc(cc1)C1=C(CC2(CC2)C1)c1ccc(F)cc1 |t:11|
Show InChI InChI=1S/C20H19FO2S/c1-24(22,23)17-8-4-15(5-9-17)19-13-20(10-11-20)12-18(19)14-2-6-16(21)7-3-14/h2-9H,10-13H2,1H3
NCI pathway
Reactome pathway
n/an/a 7.5n/an/an/an/an/an/a
The M.S University of Baroda
Curated by ChEMBL
Assay Description
Inhibition of recombinant human COX-2 expressed in Baculovirus infected sf9 cells using arachidonic acid as substrate preincubated for 10 mins follow...
Eur J Med Chem 162: 1-17 (2019)
Article DOI: 10.1016/j.ejmech.2018.10.054
Cyclooxygenase
(Homo sapiens (Human))
BDBM50049041
(5-(4-Fluoro-phenyl)-6-(4-methanesulfonyl-phenyl)-s...)
Show SMILES CS(=O)(=O)c1ccc(cc1)C1=C(CC2(CC2)C1)c1ccc(F)cc1 |t:11|
Show InChI InChI=1S/C20H19FO2S/c1-24(22,23)17-8-4-15(5-9-17)19-13-20(10-11-20)12-18(19)14-2-6-16(21)7-3-14/h2-9H,10-13H2,1H3
NCI pathway
Reactome pathway
n/an/a 8n/an/an/an/an/an/a
TBA
Curated by ChEMBL
Assay Description
Compound was evaluated in vitro for the inhibitory activity against inducible form of human recombinant Prostaglandin G/H synthase 1
Bioorg Med Chem Lett 5: 867-872 (1995)
Article DOI: 10.1016/0960-894X(95)00131-C
BindingDB Entry DOI: 10.7270/Q2P26Z3Q
Cyclooxygenase
(Homo sapiens (Human))
BDBM50049041
(5-(4-Fluoro-phenyl)-6-(4-methanesulfonyl-phenyl)-s...)
Show SMILES CS(=O)(=O)c1ccc(cc1)C1=C(CC2(CC2)C1)c1ccc(F)cc1 |t:11|
Show InChI InChI=1S/C20H19FO2S/c1-24(22,23)17-8-4-15(5-9-17)19-13-20(10-11-20)12-18(19)14-2-6-16(21)7-3-14/h2-9H,10-13H2,1H3
NCI pathway
Reactome pathway
n/an/a 1.10n/an/an/an/an/an/a
TBA
Curated by ChEMBL
Assay Description
Inhibition of PGE-2 production by arachidonic acid-stimulated CHO cells expressing human Prostaglandin G/H synthase 2
Bioorg Med Chem Lett 6: 2677-2682 (1996)
Article DOI: 10.1016/S0960-894X(96)00501-X
BindingDB Entry DOI: 10.7270/Q2RB74M8
Cyclooxygenase
(Homo sapiens (Human))
BDBM50049041
(5-(4-Fluoro-phenyl)-6-(4-methanesulfonyl-phenyl)-s...)
Show SMILES CS(=O)(=O)c1ccc(cc1)C1=C(CC2(CC2)C1)c1ccc(F)cc1 |t:11|
Show InChI InChI=1S/C20H19FO2S/c1-24(22,23)17-8-4-15(5-9-17)19-13-20(10-11-20)12-18(19)14-2-6-16(21)7-3-14/h2-9H,10-13H2,1H3
NCI pathway
Reactome pathway
n/an/a 7.59n/an/an/an/an/an/a
Universit£ de Lille 2
Curated by ChEMBL
Assay Description
Inhibition of human Prostaglandin G/H synthase 2
J Med Chem 44: 3223-30 (2001)
BindingDB Entry DOI: 10.7270/Q2736S4D
Cyclooxygenase
(Homo sapiens (Human))
BDBM50049041
(5-(4-Fluoro-phenyl)-6-(4-methanesulfonyl-phenyl)-s...)
Show SMILES CS(=O)(=O)c1ccc(cc1)C1=C(CC2(CC2)C1)c1ccc(F)cc1 |t:11|
Show InChI InChI=1S/C20H19FO2S/c1-24(22,23)17-8-4-15(5-9-17)19-13-20(10-11-20)12-18(19)14-2-6-16(21)7-3-14/h2-9H,10-13H2,1H3
NCI pathway
Reactome pathway
n/an/a 8n/an/an/an/an/an/a
Searle Research and Development
Curated by ChEMBL
Assay Description
Inhibitory activity of the compound against prostaglandin G/H synthase 2 (COX-2).
J Med Chem 39: 253-66 (1996)
Article DOI: 10.1021/jm950664x
BindingDB Entry DOI: 10.7270/Q2XG9Q6M