BDBM50049159 (R)-2-((S)-4-Carboxy-4-{4-[(2,7-dimethyl-4-oxo-3,4-dihydro-quinazolin-6-ylmethyl)-prop-2-ynyl-amino]-2-fluoro-benzoylamino}-butyrylamino)-pentanedioic acid; TFA::CHEMBL170933
SMILES: Cc1nc2cc(C)c(CN(CC#C)c3ccc(C(=O)N[C@@H](CCC(=O)N[C@H](CCC(O)=O)C(O)=O)C(O)=O)c(F)c3)cc2c(=O)[nH]1
InChI Key: InChIKey=PIGKKMGHDBPLME-RPWUZVMVSA-N
Data: 1 KI  1 IC50
Activity Spreadsheet -- Enzyme Inhibition Constant Data from BindingDB
Found 2 hits for monomerid = 50049159
Trg + Lig
Ki
nM
ΔG°
kcal/mole
IC50
nM
Kd
nM
EC50/IC50
nM
koff
s-1
kon
M-1s-1
pHTemp
°C
Thymidylate synthase
(Mus musculus)
BDBM50049159
((R)-2-((S)-4-Carboxy-4-{4-[(2,7-dimethyl-4-oxo-3,4...)
Show SMILES Cc1nc2cc(C)c(CN(CC#C)c3ccc(C(=O)N[C@@H](CCC(=O)N[C@H](CCC(O)=O)C(O)=O)C(O)=O)c(F)c3)cc2c(=O)[nH]1
Show InChI InChI=1S/C31H32FN5O9/c1-4-11-37(15-18-13-21-25(12-16(18)2)33-17(3)34-29(21)42)19-5-6-20(22(32)14-19)28(41)36-24(31(45)46)7-9-26(38)35-23(30(43)44)8-10-27(39)40/h1,5-6,12-14,23-24H,7-11,15H2,2-3H3,(H,35,38)(H,36,41)(H,39,40)(H,43,44)(H,45,46)(H,33,34,42)/t23-,24+/m1/s1
Reactome pathway
0.920n/an/an/an/an/an/an/an/a
Institute of Cancer Research
Curated by ChEMBL
Assay Description
Binding affinity of the compound against L1210 Thymidylate synthase.
J Med Chem 39: 73-85 (1996)
Article DOI: 10.1021/jm950471+
BindingDB Entry DOI: 10.7270/Q2WH2P2S
Thymidylate synthase
(Mus musculus)
BDBM50049159
((R)-2-((S)-4-Carboxy-4-{4-[(2,7-dimethyl-4-oxo-3,4...)
Show SMILES Cc1nc2cc(C)c(CN(CC#C)c3ccc(C(=O)N[C@@H](CCC(=O)N[C@H](CCC(O)=O)C(O)=O)C(O)=O)c(F)c3)cc2c(=O)[nH]1
Show InChI InChI=1S/C31H32FN5O9/c1-4-11-37(15-18-13-21-25(12-16(18)2)33-17(3)34-29(21)42)19-5-6-20(22(32)14-19)28(41)36-24(31(45)46)7-9-26(38)35-23(30(43)44)8-10-27(39)40/h1,5-6,12-14,23-24H,7-11,15H2,2-3H3,(H,35,38)(H,36,41)(H,39,40)(H,43,44)(H,45,46)(H,33,34,42)/t23-,24+/m1/s1
Reactome pathway
n/an/a 0.400n/an/an/an/an/an/a
Institute of Cancer Research
Curated by ChEMBL
Assay Description
Inhibition of Thymidylate synthase activity in L1210 cells
J Med Chem 39: 73-85 (1996)
Article DOI: 10.1021/jm950471+
BindingDB Entry DOI: 10.7270/Q2WH2P2S